curl / Autobuilds / Log From 2021-06-03

Log from 2021-06-03

[raw log download]

Jump down to problem:1 2 3 4 5 test results

testcurl: NAME = Marcel Raad
testcurl: EMAIL = Marcel.Raad /at/ teamviewer.com
testcurl: DESC = MSYS2 MinGW64 WinThreads SSPI HTTP-only OpenSSL --disable-proxy --disable-crypto-auth
testcurl: NOTES =
testcurl: CONFOPTS = --enable-threaded-resolver --disable-pthreads --enable-debug --enable-warnings --enable-curldebug --enable-optimize --enable-static --disable-shared --enable-verbose --enable-http --disable-ftp --disable-file --disable-ldap --disable-ldaps --disable-rtsp --disable-dict --disable-telnet --disable-tftp --disable-pop3 --disable-imap --disable-smb --disable-smtp --disable-gopher --disable-manual --disable-libcurl-option --enable-ipv6 --enable-sspi --disable-cookies --disable-ares --disable-unix-sockets --disable-alt-svc --disable-doh --without-zlib --without-libpsl --without-libmetalink --without-libssh2 --without-librtmp --without-winidn --without-libidn2 --without-nghttp2 --without-zsh-functions-dir --without-brotli --without-libssh --without-nghttp3 --without-ngtcp2 --without-quiche --without-fish-functions-dir --disable-proxy --disable-crypto-auth --with-openssl
testcurl: RUNTESTOPTS = -a -p -v !cookies !--libcurl !1056
testcurl: CPPFLAGS =
testcurl: CFLAGS =
testcurl: LDFLAGS =
testcurl: LIBS =
testcurl: CC =
testcurl: TMPDIR =
testcurl: MAKEFLAGS =
testcurl: ACLOCAL_FLAGS =
testcurl: PKG_CONFIG_PATH = /mingw64/lib/pkgconfig:/mingw64/share/pkgconfig
testcurl: DYLD_LIBRARY_PATH =
testcurl: LD_LIBRARY_PATH =
testcurl: LIBRARY_PATH =
testcurl: SHLIB_PATH =
testcurl: LIBPATH =
testcurl: target = mingw
testcurl: version = 2014-11-25
testcurl: date = Thu Jun 3 04:18:21 2021 UTC
testcurl: curl-7.77.1-20210603 is verified to be a fine daily source dir
testcurl: build dir build-1916 was created fine
testcurl: timestamp = 2021-06-03 UTC
testcurl: configure created (at least it exists)
testcurl: going with make as make
configure: loading site script /mingw64/etc/config.site
checking whether to enable maintainer-specific portions of Makefiles... no
checking whether make supports nested variables... yes
checking whether to enable debug build options... yes
checking whether to enable compiler optimizer... yes
checking whether to enable strict compiler warnings... yes
checking whether to enable compiler warnings as errors... no
checking whether to enable curl debug memory tracking... yes
checking whether to enable hiding of library internal symbols... yes
checking whether to enable c-ares for DNS lookups... no
checking whether to disable dependency on -lrt... (assumed no)
checking whether to enable ECH support... no
checking for path separator... :
checking for sed... /usr/bin/sed
checking for grep... /usr/bin/grep
checking for egrep... /usr/bin/grep -E
checking for ar... /mingw64/bin/ar
checking for a BSD-compatible install... /usr/bin/install -c
checking for gcc... gcc
checking whether the C compiler works... yes
checking for C compiler default output file name... a.exe
checking for suffix of executables... .exe
checking whether we are cross compiling... no
checking for suffix of object files... o
checking whether we are using the GNU C compiler... yes
checking whether gcc accepts -g... yes
checking for gcc option to accept ISO C89... none needed
checking whether gcc understands -c and -o together... yes
checking how to run the C preprocessor... gcc -E
checking for a sed that does not truncate output... (cached) /usr/bin/sed
checking for code coverage support... no
checking whether build environment is sane... yes
checking for a thread-safe mkdir -p... /usr/bin/mkdir -p
checking for gawk... gawk
checking whether make sets $(MAKE)... yes
checking whether make supports the include directive... yes (GNU style)
checking dependency style of gcc... gcc3
checking curl version... 7.77.1-20210603
checking build system type... x86_64-w64-mingw32
checking host system type... x86_64-w64-mingw32
checking for grep that handles long lines and -e... (cached) /usr/bin/grep
checking for egrep... /usr/bin/grep -E
checking if OS is AIX (to define _ALL_SOURCE)... no
checking if _THREAD_SAFE is already defined... no
checking if _THREAD_SAFE is actually needed... no
checking if _THREAD_SAFE is onwards defined... no
checking if _REENTRANT is already defined... yes
checking if _REENTRANT is onwards defined... yes
checking for special C compiler options needed for large files... no
checking for _FILE_OFFSET_BITS value needed for large files... 64
checking how to print strings... printf
checking for a sed that does not truncate output... (cached) /usr/bin/sed
checking for fgrep... /usr/bin/grep -F
checking for ld used by gcc... C:/msys64/mingw64/x86_64-w64-mingw32/bin/ld.exe
checking if the linker (C:/msys64/mingw64/x86_64-w64-mingw32/bin/ld.exe) is GNU ld... yes
checking for BSD- or MS-compatible name lister (nm)... /mingw64/bin/nm -B
checking the name lister (/mingw64/bin/nm -B) interface... BSD nm
checking whether ln -s works... no, using cp -pR
checking the maximum length of command line arguments... 8192
checking how to convert x86_64-w64-mingw32 file names to x86_64-w64-mingw32 format... func_convert_file_msys_to_w32
checking how to convert x86_64-w64-mingw32 file names to toolchain format... func_convert_file_msys_to_w32
checking for C:/msys64/mingw64/x86_64-w64-mingw32/bin/ld.exe option to reload object files... -r
checking for objdump... objdump
checking how to recognize dependent libraries... file_magic ^x86 archive import|^x86 DLL
checking for dlltool... dlltool
checking how to associate runtime and link libraries... func_cygming_dll_for_implib
checking for archiver @FILE support... @
checking for strip... strip
checking for ranlib... ranlib
checking command to parse /mingw64/bin/nm -B output from gcc object... ok
checking for sysroot... no
checking for a working dd... /usr/bin/dd
checking how to truncate binary pipes... /usr/bin/dd bs=4096 count=1
checking for mt... no
checking if : is a manifest tool... no
checking for ANSI C header files... yes
checking for sys/types.h... yes
checking for sys/stat.h... yes
checking for stdlib.h... yes
checking for string.h... yes
checking for memory.h... yes
checking for strings.h... yes
checking for inttypes.h... yes
checking for stdint.h... yes
checking for unistd.h... yes
checking for dlfcn.h... no
checking for as... as
checking for dlltool... (cached) dlltool
checking for objdump... (cached) objdump
checking for objdir... .libs
checking if gcc supports -fno-rtti -fno-exceptions... no
checking for gcc option to produce PIC... -DDLL_EXPORT -DPIC
checking if gcc PIC flag -DDLL_EXPORT -DPIC works... yes
checking if gcc static flag -static works... yes
checking if gcc supports -c -o file.o... yes
checking if gcc supports -c -o file.o... (cached) yes
checking whether the gcc linker (C:/msys64/mingw64/x86_64-w64-mingw32/bin/ld.exe) supports shared libraries... yes
checking dynamic linker characteristics... Win32 ld.exe
checking how to hardcode library paths into programs... immediate
checking whether stripping libraries is possible... yes
checking if libtool supports shared libraries... yes
checking whether to build shared libraries... no
checking whether to build static libraries... yes
checking whether to build shared libraries with -version-info... yes
checking whether to build shared libraries with -no-undefined... yes
checking whether to build shared libraries with -mimpure-text... no
checking whether to build shared libraries with PIC... yes
checking whether to build static libraries with PIC... no
checking whether to build shared libraries only... no
checking whether to build static libraries only... yes
checking for inline... inline
checking if cpp -P is needed... yes
checking if cpp -P works... yes
checking if compiler is DEC/Compaq/HP C... no
checking if compiler is HP-UX C... no
checking if compiler is IBM C... no
checking if compiler is Intel C... no
checking if compiler is clang... no
checking if compiler is GNU C... yes
checking if compiler is LCC... no
checking if compiler is SGI MIPSpro C... no
checking if compiler is SGI MIPS C... no
checking if compiler is SunPro C... no
checking if compiler is Tiny C... no
checking if compiler is Watcom C... no
checking if compiler accepts some basic options... yes
configure: compiler options added: -Werror-implicit-function-declaration
checking if compiler accepts debug enabling options... yes
configure: compiler options added: -g
checking if compiler accepts optimizer enabling options... yes
configure: compiler options added: -O2
checking if compiler accepts strict warning options... yes
configure: compiler options added: -pedantic -Wall -W -Wpointer-arith -Wwrite-strings -Wunused -Wshadow -Winline -Wnested-externs -Wmissing-declarations -Wmissing-prototypes -Wno-long-long -Wbad-function-cast -Wfloat-equal -Wno-multichar -Wsign-compare -Wundef -Wno-format-nonliteral -Wendif-labels -Wstrict-prototypes -Wdeclaration-after-statement -Wold-style-definition -Wstrict-aliasing=3 -Wcast-align -Wtype-limits -Wold-style-declaration -Wmissing-parameter-type -Wempty-body -Wclobbered -Wignored-qualifiers -Wconversion -Wno-sign-conversion -Wvla -ftree-vrp -Wno-pedantic-ms-format -Wdouble-promotion -Wformat=2 -Warray-bounds=2 -Wshift-negative-value -Wshift-overflow=2 -Wnull-dereference -fdelete-null-pointer-checks -Wduplicated-cond -Wunused-const-variable -Wduplicated-branches -Wrestrict -Walloc-zero -Wformat-overflow=2 -Wformat-truncation=2 -Wimplicit-fallthrough=4 -Wno-system-headers -Wenum-conversion
checking if compiler halts on compilation errors... yes
checking if compiler halts on negative sized arrays... yes
checking if compiler halts on function prototype mismatch... yes
checking if compiler supports hiding library internal symbols... yes
checking if curl debug memory tracking can be enabled... yes
checking for windows.h... yes
checking whether build target is a native Windows one... yes
checking for winsock.h... yes
checking for winsock2.h... yes
checking for ws2tcpip.h... yes
checking for wincrypt.h... yes
checking for winldap.h... yes
checking for winber.h... yes
checking whether build target supports WIN32 file API... yes (large file enabled)
checking whether build target supports WIN32 crypto API... yes
checking for good-to-use Darwin CFLAGS... no
checking whether to link macOS SystemConfiguration framework... no
checking to see if the compiler supports __builtin_available()... no
checking whether to support http... yes
checking whether to support ftp... no
checking whether to support file... no
checking whether to support ldap... no
checking whether to support ldaps... no
checking whether to support rtsp... no
checking whether to support proxies... no
checking whether to support dict... no
checking whether to support telnet... no
checking whether to support tftp... no
checking whether to support pop3... no
checking whether to support imap... no
checking whether to support smb... no
checking whether to support smtp... no
checking whether to support gopher... no
checking whether to support mqtt... no
checking whether to provide built-in manual... no
checking whether to enable generation of C code... no
checking whether to use libgcc... no
checking if X/Open network library is required... no
checking for gethostbyname... no
checking for gethostbyname in -lnsl... no
checking for gethostbyname in -lsocket... no
checking for gethostbyname in -lwatt... no
checking for gethostbyname with both nsl and socket libs... no
checking for gethostbyname in -lws2_32... yes
checking for windows.h... (cached) yes
checking for winsock.h... (cached) yes
checking for winsock2.h... (cached) yes
checking for proto/bsdsocket.h... no
checking for connect in libraries... yes
checking for sys/types.h... (cached) yes
checking sys/time.h usability... yes
checking sys/time.h presence... yes
checking for sys/time.h... yes
checking for monotonic clock_gettime... yes
checking for clock_gettime in libraries... no additional lib required
checking if monotonic clock_gettime works... yes
configure: WARNING: zlib disabled
checking for ZSTD_createDStream in -lzstd... yes
checking zstd.h usability... yes
checking zstd.h presence... yes
checking for zstd.h... yes
checking whether to enable IPv6... yes
checking if struct sockaddr_in6 has sin6_scope_id member... yes
checking if argv can be written to... yes
checking if GSS-API support is requested... no
checking whether to enable Windows native SSL/TLS... no
checking whether to enable Secure Transport... no
checking whether to enable Amiga native SSL/TLS (AmiSSL)... no
checking for gdi32... yes
checking for pkg-config... /mingw64/bin/pkg-config
checking for openssl options with pkg-config... found
configure: pkg-config: SSL_LIBS: "-lssl -lcrypto"
configure: pkg-config: SSL_LDFLAGS: "-LC:/msys64/mingw64/lib"
configure: pkg-config: SSL_CPPFLAGS: "-IC:/msys64/mingw64/include"
checking for HMAC_Update in -lcrypto... yes
checking for SSL_connect in -lssl... yes
checking openssl/x509.h usability... yes
checking openssl/x509.h presence... yes
checking for openssl/x509.h... yes
checking openssl/rsa.h usability... yes
checking openssl/rsa.h presence... yes
checking for openssl/rsa.h... yes
checking openssl/crypto.h usability... yes
checking openssl/crypto.h presence... yes
checking for openssl/crypto.h... yes
checking openssl/pem.h usability... yes
checking openssl/pem.h presence... yes
checking for openssl/pem.h... yes
checking openssl/ssl.h usability... yes
checking openssl/ssl.h presence... yes
checking for openssl/ssl.h... yes
checking openssl/err.h usability... yes
checking openssl/err.h presence... yes
checking for openssl/err.h... yes
checking for RAND_egd... no
checking for SSLv2_client_method... no
checking for OpenSSL_version... yes
checking for BoringSSL... no
checking for libressl... no
checking for OpenSSL >= v3... no
configure: Added C:/msys64/mingw64/lib to CURL_LIBRARY_PATH
checking for OpenSSL headers version... 1.1.1 - 0x1010107fL
checking for OpenSSL library version... 1.1.1
checking for OpenSSL headers and library versions matching... yes
checking for "/dev/urandom"... yes
checking for SRP_Calc_client_key in -lcrypto... yes
configure: built with one SSL backend
checking default CA cert bundle/path... no
checking whether to use builtin CA store of SSL library... no
checking for library containing gsasl_init... -lgsasl
checking whether versioned symbols are wanted... no
checking whether to enable Windows native IDN (Windows native builds only)... no
checking whether to build with libidn2... no
checking for malloc.h... yes
checking for memory.h... no
checking for sys/types.h... (cached) yes
checking for sys/time.h... (cached) yes
checking for sys/select.h... no
checking for sys/socket.h... no
checking for sys/ioctl.h... no
checking for sys/uio.h... no
checking for assert.h... yes
checking for unistd.h... (cached) yes
checking for stdlib.h... (cached) yes
checking for arpa/inet.h... no
checking for net/if.h... no
checking for netinet/in.h... no
checking for netinet/in6.h... no
checking for sys/un.h... no
checking for linux/tcp.h... no
checking for netinet/tcp.h... no
checking for netdb.h... no
checking for sys/sockio.h... no
checking for sys/stat.h... (cached) yes
checking for sys/param.h... yes
checking for termios.h... no
checking for termio.h... no
checking for sgtty.h... no
checking for fcntl.h... yes
checking for alloca.h... no
checking for io.h... yes
checking for pwd.h... no
checking for utime.h... yes
checking for sys/utime.h... yes
checking for sys/poll.h... no
checking for poll.h... no
checking for socket.h... no
checking for sys/resource.h... no
checking for libgen.h... yes
checking for locale.h... yes
checking for errno.h... yes
checking for stdbool.h... yes
checking for arpa/tftp.h... no
checking for sys/filio.h... no
checking for sys/wait.h... no
checking for setjmp.h... yes
checking for an ANSI C-conforming const... yes
checking for compiler support of C99 variadic macro style... yes
checking for compiler support of old gcc variadic macro style... yes
checking for size_t... yes
checking for sys/types.h... (cached) yes
checking for sys/time.h... (cached) yes
checking for sys/socket.h... (cached) no
checking for struct timeval... yes
checking run-time libs availability... fine
checking size of size_t... 8
checking size of long... 4
checking size of int... 4
checking size of short... 2
checking size of time_t... 8
checking size of off_t... 8
checking size of curl_off_t... 8
checking for long long... yes
checking if numberLL works... yes
checking for ssize_t... yes
checking for bool... yes
checking for sa_family_t... no
checking for ADDRESS_FAMILY... no
checking for suseconds_t... no
checking if time_t is unsigned... no
checking for sys/types.h... (cached) yes
checking for poll.h... (cached) no
checking for sys/poll.h... (cached) no
checking for in_addr_t... no
checking for in_addr_t equivalent... unsigned long
checking for struct sockaddr_storage... yes
checking signal.h usability... yes
checking signal.h presence... yes
checking for signal.h... yes
checking for sig_atomic_t... yes
checking if sig_atomic_t is already defined as volatile... no
checking for sys/select.h... (cached) no
checking for sys/socket.h... (cached) no
checking for select... yes
checking types of args and return type for select... int,fd_set *,struct timeval *,int
checking for sys/types.h... (cached) yes
checking for sys/socket.h... (cached) no
checking for recv... yes
checking types of args and return type for recv... SOCKET,char *,int,int,int
checking for sys/types.h... (cached) yes
checking for sys/socket.h... (cached) no
checking for send... yes
checking types of args and return type for send... SOCKET,const char *,int,int,int
checking for sys/types.h... (cached) yes
checking for sys/socket.h... (cached) no
checking for MSG_NOSIGNAL... no
checking for sys/types.h... (cached) yes
checking for unistd.h... (cached) yes
checking if alarm can be linked... yes
checking if alarm is prototyped... no
checking if alarm might be used... no
checking for sys/types.h... (cached) yes
checking for string.h... (cached) yes
checking for strings.h... (cached) yes
checking for sys/types.h... (cached) yes
checking for libgen.h... (cached) yes
checking if basename can be linked... yes
checking if basename is prototyped... yes
checking if basename is compilable... yes
checking if basename usage allowed... yes
checking if basename might be used... yes
checking for sys/types.h... (cached) yes
checking for socket.h... (cached) no
checking if closesocket can be linked... yes
checking if closesocket is prototyped... yes
checking if closesocket is compilable... yes
checking if closesocket usage allowed... yes
checking if closesocket might be used... yes
checking for sys/types.h... (cached) yes
checking for sys/socket.h... (cached) no
checking if CloseSocket can be linked... no
checking if CloseSocket might be used... no
checking if connect can be linked... yes
checking if connect is prototyped... yes
checking if connect is compilable... yes
checking if connect usage allowed... yes
checking if connect might be used... yes
checking for sys/types.h... (cached) yes
checking for unistd.h... (cached) yes
checking for fcntl.h... (cached) yes
checking if fcntl can be linked... no
checking if fcntl might be used... no
checking for windows.h... (cached) yes
checking for winsock2.h... (cached) yes
checking for ws2tcpip.h... (cached) yes
checking for sys/types.h... (cached) yes
checking for netdb.h... (cached) no
checking if freeaddrinfo can be linked... yes
checking if freeaddrinfo is prototyped... yes
checking if freeaddrinfo is compilable... yes
checking if freeaddrinfo usage allowed... yes
checking if freeaddrinfo might be used... yes
checking for sys/types.h... (cached) yes
checking for sys/socket.h... (cached) no
checking for netinet/in.h... (cached) no
checking for ifaddrs.h... no
checking if freeifaddrs can be linked... no
checking if freeifaddrs might be used... no
checking for sys/types.h... (cached) yes
checking for sys/xattr.h... no
checking if fsetxattr can be linked... no
checking if fsetxattr might be used... no
checking if ftruncate can be linked... yes
checking if ftruncate is prototyped... yes
checking if ftruncate is compilable... yes
checking if ftruncate usage allowed... yes
checking if ftruncate might be used... yes
checking for sys/types.h... (cached) yes
checking for stdlib.h... (cached) yes
checking if getaddrinfo can be linked... yes
checking if getaddrinfo is prototyped... yes
checking if getaddrinfo is compilable... yes
checking if getaddrinfo seems to work... yes
checking if getaddrinfo usage allowed... yes
checking if getaddrinfo might be used... yes
checking if getaddrinfo is threadsafe... yes
checking if gai_strerror can be linked... no
checking if gai_strerror might be used... no
checking if gethostbyaddr can be linked... yes
checking if gethostbyaddr is prototyped... yes
checking if gethostbyaddr is compilable... yes
checking if gethostbyaddr usage allowed... yes
checking if gethostbyaddr might be used... yes
checking if gethostbyaddr_r can be linked... no
checking if gethostbyaddr_r might be used... no
checking if gethostbyname can be linked... yes
checking if gethostbyname is prototyped... yes
checking if gethostbyname is compilable... yes
checking if gethostbyname usage allowed... yes
checking if gethostbyname might be used... yes
checking if gethostbyname_r can be linked... no
checking if gethostbyname_r might be used... no
checking if gethostname can be linked... yes
checking if gethostname is prototyped... yes
checking if gethostname is compilable... yes
checking for gethostname arg 2 data type... int
checking if gethostname usage allowed... yes
checking if gethostname might be used... yes
checking if getpeername can be linked... yes
checking if getpeername is prototyped... yes
checking if getpeername is compilable... yes
checking if getpeername usage allowed... yes
checking if getpeername might be used... yes
checking if getsockname can be linked... yes
checking if getsockname is prototyped... yes
checking if getsockname is compilable... yes
checking if getsockname usage allowed... yes
checking if getsockname might be used... yes
checking for net/if.h... (cached) no
checking if if_nametoindex can be linked... no
checking if if_nametoindex might be used... no
checking if getifaddrs can be linked... no
checking if getifaddrs might be used... no
checking if getservbyport_r can be linked... no
checking if getservbyport_r might be used... no
checking for sys/types.h... (cached) yes
checking for sys/time.h... (cached) yes
checking if gmtime_r can be linked... no
checking if gmtime_r might be used... no
checking for sys/types.h... (cached) yes
checking for sys/socket.h... (cached) no
checking for netinet/in.h... (cached) no
checking for arpa/inet.h... (cached) no
checking if inet_ntoa_r can be linked... no
checking if inet_ntoa_r might be used... no
checking if inet_ntop can be linked... yes
checking if inet_ntop is prototyped... yes
checking if inet_ntop is compilable... yes
checking if inet_ntop seems to work... yes
checking if inet_ntop usage allowed... yes
checking if inet_ntop might be used... yes
checking if inet_pton can be linked... yes
checking if inet_pton is prototyped... yes
checking if inet_pton is compilable... yes
checking if inet_pton seems to work... yes
checking if inet_pton usage allowed... yes
checking if inet_pton might be used... yes
checking for sys/types.h... (cached) yes
checking for unistd.h... (cached) yes
checking for sys/socket.h... (cached) no
checking for sys/ioctl.h... (cached) no
checking for stropts.h... no
checking if ioctl can be linked... no
checking if ioctl might be used... no
checking if ioctlsocket can be linked... yes
checking if ioctlsocket is prototyped... yes
checking if ioctlsocket is compilable... yes
checking if ioctlsocket usage allowed... yes
checking if ioctlsocket might be used... yes
checking if ioctlsocket FIONBIO is compilable... yes
checking if ioctlsocket FIONBIO usage allowed... yes
checking if ioctlsocket FIONBIO might be used... yes
checking if IoctlSocket can be linked... no
checking if IoctlSocket might be used... no
checking if localtime_r can be linked... no
checking if localtime_r might be used... no
checking if memrchr can be linked... no
checking if memrchr seems a macro... no
checking if memrchr might be used... no
checking if poll can be linked... no
checking if poll might be used... no
checking if setsockopt can be linked... yes
checking if setsockopt is prototyped... yes
checking if setsockopt is compilable... yes
checking if setsockopt usage allowed... yes
checking if setsockopt might be used... yes
checking if setsockopt SO_NONBLOCK is compilable... no
checking if setsockopt SO_NONBLOCK might be used... no
checking for sys/types.h... (cached) yes
checking for signal.h... (cached) yes
checking if sigaction can be linked... no
checking if sigaction might be used... no
checking if siginterrupt can be linked... no
checking if siginterrupt might be used... no
checking if signal can be linked... yes
checking if signal is prototyped... yes
checking if signal is compilable... yes
checking if signal usage allowed... yes
checking if signal might be used... yes
checking for sys/types.h... (cached) yes
checking for setjmp.h... (cached) yes
checking if sigsetjmp can be linked... no
checking if sigsetjmp seems a macro... no
checking if sigsetjmp might be used... no
checking if socket can be linked... yes
checking if socket is prototyped... yes
checking if socket is compilable... yes
checking if socket usage allowed... yes
checking if socket might be used... yes
checking if socketpair can be linked... no
checking if socketpair might be used... no
checking if strcasecmp can be linked... yes
checking if strcasecmp is prototyped... yes
checking if strcasecmp is compilable... yes
checking if strcasecmp usage allowed... yes
checking if strcasecmp might be used... yes
checking if strcmpi can be linked... yes
checking if strcmpi is prototyped... yes
checking if strcmpi is compilable... yes
checking if strcmpi usage allowed... yes
checking if strcmpi might be used... yes
checking if strdup can be linked... yes
checking if strdup is prototyped... yes
checking if strdup is compilable... yes
checking if strdup usage allowed... yes
checking if strdup might be used... yes
checking if strerror_r can be linked... no
checking if strerror_r might be used... no
checking if stricmp can be linked... yes
checking if stricmp is prototyped... yes
checking if stricmp is compilable... yes
checking if stricmp usage allowed... yes
checking if stricmp might be used... yes
checking if strncmpi can be linked... no
checking if strncmpi might be used... no
checking if strnicmp can be linked... yes
checking if strnicmp is prototyped... yes
checking if strnicmp is compilable... no
checking if strnicmp might be used... no
checking if strstr can be linked... yes
checking if strstr is prototyped... yes
checking if strstr is compilable... yes
checking if strstr usage allowed... yes
checking if strstr might be used... yes
checking if strtok_r can be linked... yes
checking if strtok_r is prototyped... yes
checking if strtok_r is compilable... yes
checking if strtok_r usage allowed... yes
checking if strtok_r might be used... yes
checking if strtoll can be linked... yes
checking if strtoll is prototyped... yes
checking if strtoll is compilable... yes
checking if strtoll usage allowed... yes
checking if strtoll might be used... yes
checking for sys/types.h... (cached) yes
checking for sys/uio.h... (cached) no
checking if writev can be linked... no
checking if writev might be used... no
checking whether getpwuid_r is declared... no
checking for fnmatch... no
checking deeper for fnmatch... but still no
checking for geteuid... no
checking deeper for geteuid... but still no
checking for getpass_r... no
checking deeper for getpass_r... but still no
checking for getppid... no
checking deeper for getppid... but still no
checking for getpwuid... no
checking deeper for getpwuid... but still no
checking for getpwuid_r... no
checking deeper for getpwuid_r... but still no
checking for getrlimit... no
checking deeper for getrlimit... but still no
checking for gettimeofday... yes
checking for if_nametoindex... no
checking deeper for if_nametoindex... but still no
checking for mach_absolute_time... no
checking deeper for mach_absolute_time... but still no
checking for pipe... no
checking deeper for pipe... but still no
checking for setlocale... yes
checking for setmode... yes
checking for setrlimit... no
checking deeper for setrlimit... but still no
checking for usleep... yes
checking for utime... yes
checking for utimes... no
checking deeper for utimes... but still no
checking how to set a socket into non-blocking mode... ioctlsocket FIONBIO
checking for perl... /usr/bin/perl
checking for gnroff... no
checking for nroff... /usr/bin/nroff
checking how to use *nroff to get plain text from man pages... -man
checking whether to enable the threaded resolver... yes
checking whether to use POSIX threads for threaded resolver... no
checking convert -I options to -isystem... yes
checking whether to enable verbose strings... yes
checking whether to enable SSPI support (Windows native builds only)... yes
checking whether to enable cryptographic authentication methods... no
checking whether to support NTLM... yes
checking whether to enable NTLM delegation to winbind's helper... no
checking whether to enable TLS-SRP authentication... yes
checking whether to enable Unix domain sockets... no
checking whether to support cookies... no
checking whether to support socketpair... yes
checking whether to support HTTP authentication... yes
checking whether to support DoH... no
checking whether to support the MIME API... yes
checking whether to support date parsing... yes
checking whether to support netrc parsing... yes
checking whether to support progress-meter... yes
checking whether to support DNS shuffling... yes
checking whether to support curl_easy_option*... yes
checking whether to support alt-svc... no
checking whether to support HSTS... yes
checking whether hiding of library internal symbols will actually happen... no
checking that generated files are newer than configure... done
configure: creating ./config.status
config.status: creating Makefile
config.status: creating docs/Makefile
config.status: creating docs/examples/Makefile
config.status: creating docs/libcurl/Makefile
config.status: creating docs/libcurl/opts/Makefile
config.status: creating docs/cmdline-opts/Makefile
config.status: creating include/Makefile
config.status: creating include/curl/Makefile
config.status: creating src/Makefile
config.status: creating lib/Makefile
config.status: creating scripts/Makefile
config.status: creating lib/libcurl.vers
config.status: creating tests/Makefile
config.status: creating tests/certs/Makefile
config.status: creating tests/certs/scripts/Makefile
config.status: creating tests/data/Makefile
config.status: creating tests/server/Makefile
config.status: creating tests/libtest/Makefile
config.status: creating tests/unit/Makefile
config.status: creating packages/Makefile
config.status: creating packages/vms/Makefile
config.status: creating curl-config
config.status: creating libcurl.pc
config.status: creating lib/curl_config.h
config.status: executing depfiles commands
config.status: executing libtool commands
configure: amending lib/Makefile
configure: amending src/Makefile
configure: amending tests/unit/Makefile
configure: amending tests/server/Makefile
configure: amending tests/libtest/Makefile
configure: amending docs/examples/Makefile
configure: Configured to build curl/libcurl:

Host setup: x86_64-w64-mingw32
Install prefix: /mingw64
Compiler: gcc
CFLAGS: -Werror-implicit-function-declaration -g -O2 -pedantic -Wall -W -Wpointer-arith -Wwrite-strings -Wunused -Wshadow -Winline -Wnested-externs -Wmissing-declarations -Wmissing-prototypes -Wno-long-long -Wbad-function-cast -Wfloat-equal -Wno-multichar -Wsign-compare -Wundef -Wno-format-nonliteral -Wendif-labels -Wstrict-prototypes -Wdeclaration-after-statement -Wold-style-definition -Wstrict-aliasing=3 -Wcast-align -Wtype-limits -Wold-style-declaration -Wmissing-parameter-type -Wempty-body -Wclobbered -Wignored-qualifiers -Wconversion -Wno-sign-conversion -Wvla -ftree-vrp -Wno-pedantic-ms-format -Wdouble-promotion -Wformat=2 -Warray-bounds=2 -Wshift-negative-value -Wshift-overflow=2 -Wnull-dereference -fdelete-null-pointer-checks -Wduplicated-cond -Wunused-const-variable -Wduplicated-branches -Wrestrict -Walloc-zero -Wformat-overflow=2 -Wformat-truncation=2 -Wimplicit-fallthrough=4 -Wno-system-headers -Wenum-conversion
CPPFLAGS: -isystem C:/msys64/mingw64/include
LDFLAGS: -LC:/msys64/mingw64/lib
LIBS: -lgsasl -ladvapi32 -lcrypt32 -lssl -lcrypto -lssl -lcrypto -lgdi32 -lzstd -lws2_32

curl version: 7.77.1-20210603
SSL: enabled (OpenSSL)
SSH: no (--with-{libssh,libssh2})
zlib: no (--with-zlib)
brotli: no (--with-brotli)
zstd: enabled (libzstd)
GSS-API: no (--with-gssapi)
GSASL: enabled
TLS-SRP: enabled
resolver: Win32 threaded
IPv6: enabled
Unix sockets: no (--enable-unix-sockets)
IDN: no (--with-{libidn2,winidn})
Build libcurl: Shared=no, Static=yes
Built-in manual: no (--enable-manual)
--libcurl option: no
Verbose errors: enabled (--disable-verbose)
Code coverage: disabled
SSPI: enabled
ca cert bundle: no
ca cert path: no
ca fallback: no
LDAP: no (--enable-ldap / --with-ldap-lib / --with-lber-lib)
LDAPS: no (--enable-ldaps)
RTSP: no (--enable-rtsp)
RTMP: no (--with-librtmp)
Metalink: no (--with-libmetalink)
PSL: no (--with-libpsl)
Alt-svc: no
HSTS: enabled (--disable-hsts)
HTTP1: enabled (internal)
HTTP2: no (--with-nghttp2, --with-hyper)
HTTP3: no (--with-ngtcp2, --with-quiche)
ECH: no (--enable-ech)
Protocols: HTTP HTTPS MQTT
Features: AsynchDNS GSASL HSTS IPv6 Largefile SSL SSPI TLS-SRP zstd

testcurl: configure seems to have finished fine

testcurl: display libcurl.pc

prefix=/mingw64
exec_prefix=${prefix}
libdir=${exec_prefix}/lib
includedir=${prefix}/include
supported_protocols="HTTP HTTPS MQTT"
supported_features="AsynchDNS GSASL HSTS IPv6 Largefile SSL SSPI TLS-SRP zstd"
Name: libcurl
URL: https://curl.se/
Description: Library to transfer files with ftp, http, etc.
Version: 7.77.1-20210603
Libs: -L${libdir} -lcurl -lgsasl -ladvapi32 -lcrypt32 -lssl -lcrypto -lssl -lcrypto -lgdi32 -lzstd -lws2_32
Libs.private: -lgsasl -ladvapi32 -lcrypt32 -lssl -lcrypto -lssl -lcrypto -lgdi32 -lzstd -lws2_32
Cflags: -I${includedir} -DCURL_STATICLIB

testcurl: display lib/curl_config.h

#define CURLDEBUG 1
#define CURL_DISABLE_ALTSVC 1
#define CURL_DISABLE_COOKIES 1
#define CURL_DISABLE_CRYPTO_AUTH 1
#define CURL_DISABLE_DICT 1
#define CURL_DISABLE_DOH 1
#define CURL_DISABLE_FILE 1
#define CURL_DISABLE_FTP 1
#define CURL_DISABLE_GOPHER 1
#define CURL_DISABLE_IMAP 1
#define CURL_DISABLE_LDAP 1
#define CURL_DISABLE_LDAPS 1
#define CURL_DISABLE_LIBCURL_OPTION 1
#define CURL_DISABLE_POP3 1
#define CURL_DISABLE_PROXY 1
#define CURL_DISABLE_RTSP 1
#define CURL_DISABLE_SMB 1
#define CURL_DISABLE_SMTP 1
#define CURL_DISABLE_TELNET 1
#define CURL_DISABLE_TFTP 1
#define CURL_SA_FAMILY_T unsigned short
#define DEBUGBUILD 1
#define ENABLE_IPV6 1
#define GETHOSTNAME_TYPE_ARG2 int
#define HAVE_ASSERT_H 1
#define HAVE_BASENAME 1
#define HAVE_BOOL_T 1
#define HAVE_CLOCK_GETTIME_MONOTONIC 1
#define HAVE_CLOSESOCKET 1
#define HAVE_CONNECT 1
#define HAVE_DECL_GETPWUID_R 0
#define HAVE_DECL_GETPWUID_R_MISSING 1
#define HAVE_ERRNO_H 1
#define HAVE_FCNTL_H 1
#define HAVE_FREEADDRINFO 1
#define HAVE_FTRUNCATE 1
#define HAVE_GETADDRINFO 1
#define HAVE_GETADDRINFO_THREADSAFE 1
#define HAVE_GETHOSTBYADDR 1
#define HAVE_GETHOSTBYNAME 1
#define HAVE_GETHOSTNAME 1
#define HAVE_GETPEERNAME 1
#define HAVE_GETSOCKNAME 1
#define HAVE_GETTIMEOFDAY 1
#define HAVE_INET_NTOP 1
#define HAVE_INET_PTON 1
#define HAVE_INTTYPES_H 1
#define HAVE_IOCTLSOCKET 1
#define HAVE_IOCTLSOCKET_FIONBIO 1
#define HAVE_IO_H 1
#define HAVE_LIBGEN_H 1
#define HAVE_LIBSSL 1
#define HAVE_LIBZSTD 1
#define HAVE_LL 1
#define HAVE_LOCALE_H 1
#define HAVE_LONGLONG 1
#define HAVE_MALLOC_H 1
#define HAVE_MEMORY_H 1
#define HAVE_OPENSSL_CRYPTO_H 1
#define HAVE_OPENSSL_ERR_H 1
#define HAVE_OPENSSL_PEM_H 1
#define HAVE_OPENSSL_RSA_H 1
#define HAVE_OPENSSL_SRP 1
#define HAVE_OPENSSL_SSL_H 1
#define HAVE_OPENSSL_VERSION 1
#define HAVE_OPENSSL_X509_H 1
#define HAVE_RECV 1
#define HAVE_SELECT 1
#define HAVE_SEND 1
#define HAVE_SETJMP_H 1
#define HAVE_SETLOCALE 1
#define HAVE_SETMODE 1
#define HAVE_SETSOCKOPT 1
#define HAVE_SIGNAL 1
#define HAVE_SIGNAL_H 1
#define HAVE_SIG_ATOMIC_T 1
#define HAVE_SOCKADDR_IN6_SIN6_SCOPE_ID 1
#define HAVE_SOCKET 1
#define HAVE_STDBOOL_H 1
#define HAVE_STDINT_H 1
#define HAVE_STDLIB_H 1
#define HAVE_STRCASECMP 1
#define HAVE_STRCMPI 1
#define HAVE_STRDUP 1
#define HAVE_STRICMP 1
#define HAVE_STRINGS_H 1
#define HAVE_STRING_H 1
#define HAVE_STRSTR 1
#define HAVE_STRTOK_R 1
#define HAVE_STRTOLL 1
#define HAVE_STRUCT_SOCKADDR_STORAGE 1
#define HAVE_STRUCT_TIMEVAL 1
#define HAVE_SYS_PARAM_H 1
#define HAVE_SYS_STAT_H 1
#define HAVE_SYS_TIME_H 1
#define HAVE_SYS_TYPES_H 1
#define HAVE_SYS_UTIME_H 1
#define HAVE_UNISTD_H 1
#define HAVE_USLEEP 1
#define HAVE_UTIME 1
#define HAVE_UTIME_H 1
#define HAVE_VARIADIC_MACROS_C99 1
#define HAVE_VARIADIC_MACROS_GCC 1
#define HAVE_WINBER_H 1
#define HAVE_WINCRYPT_H 1
#define HAVE_WINDOWS_H 1
#define HAVE_WINLDAP_H 1
#define HAVE_WINSOCK2_H 1
#define HAVE_WINSOCK_H 1
#define HAVE_WRITABLE_ARGV 1
#define HAVE_WS2TCPIP_H 1
#define HAVE_ZSTD 1
#define HAVE_ZSTD_H 1
#define LT_OBJDIR ".libs/"
#define NEED_REENTRANT 1
#define OS "x86_64-w64-mingw32"
#define PACKAGE "curl"
#define PACKAGE_BUGREPORT "a suitable curl mailing list: https://curl.se/mail/"
#define PACKAGE_NAME "curl"
#define PACKAGE_STRING "curl -"
#define PACKAGE_TARNAME "curl"
#define PACKAGE_URL ""
#define PACKAGE_VERSION "-"
#define RANDOM_FILE "/dev/urandom"
#define RECV_TYPE_ARG1 SOCKET
#define RECV_TYPE_ARG2 char *
#define RECV_TYPE_ARG3 int
#define RECV_TYPE_ARG4 int
#define RECV_TYPE_RETV int
#define SELECT_QUAL_ARG5
#define SELECT_TYPE_ARG1 int
#define SELECT_TYPE_ARG234 fd_set *
#define SELECT_TYPE_ARG5 struct timeval *
#define SELECT_TYPE_RETV int
#define SEND_QUAL_ARG2 const
#define SEND_TYPE_ARG1 SOCKET
#define SEND_TYPE_ARG2 char *
#define SEND_TYPE_ARG3 int
#define SEND_TYPE_ARG4 int
#define SEND_TYPE_RETV int
#define SIZEOF_CURL_OFF_T 8
#define SIZEOF_INT 4
#define SIZEOF_LONG 4
#define SIZEOF_OFF_T 8
#define SIZEOF_SHORT 2
#define SIZEOF_SIZE_T 8
#define SIZEOF_TIME_T 8
#define STDC_HEADERS 1
#define USE_GSASL 1
#define USE_OPENSSL 1
#define USE_THREADS_WIN32 1
#define USE_TLS_SRP 1
#define USE_WIN32_CRYPTO 1
#define USE_WIN32_LARGE_FILES 1
#define USE_WINDOWS_SSPI 1
#define VERSION "-"
#ifndef _ALL_SOURCE
#endif
#ifndef _DARWIN_USE_64_BIT_INODE
# define _DARWIN_USE_64_BIT_INODE 1
#endif
#define _FILE_OFFSET_BITS 64
#define in_addr_t unsigned long
#ifndef __cplusplus
#endif
testcurl: make -i
Making all in lib
make[1]: Entering directory '/build-1916/lib'
make all-am
make[2]: Entering directory '/build-1916/lib'
CC libcurl_la-altsvc.lo
CC libcurl_la-amigaos.lo
CC libcurl_la-asyn-ares.lo
CC libcurl_la-asyn-thread.lo
CC libcurl_la-base64.lo
CC libcurl_la-bufref.lo
CC libcurl_la-c-hyper.lo
CC libcurl_la-conncache.lo
CC libcurl_la-connect.lo
CC libcurl_la-content_encoding.lo
CC libcurl_la-cookie.lo
CC libcurl_la-curl_addrinfo.lo
CC libcurl_la-curl_ctype.lo
CC libcurl_la-curl_des.lo
CC libcurl_la-curl_endian.lo
CC libcurl_la-curl_fnmatch.lo
CC libcurl_la-curl_get_line.lo
CC libcurl_la-curl_gethostname.lo
CC libcurl_la-curl_gssapi.lo
CC libcurl_la-curl_memrchr.lo
CC libcurl_la-curl_multibyte.lo
CC libcurl_la-curl_ntlm_core.lo
CC libcurl_la-curl_ntlm_wb.lo
CC libcurl_la-curl_path.lo
CC libcurl_la-curl_range.lo
CC libcurl_la-curl_rtmp.lo
CC libcurl_la-curl_sasl.lo
CC libcurl_la-curl_sspi.lo
CC libcurl_la-curl_threads.lo
CC libcurl_la-dict.lo
CC libcurl_la-doh.lo
CC libcurl_la-dotdot.lo
CC libcurl_la-dynbuf.lo
CC libcurl_la-easy.lo
CC libcurl_la-easygetopt.lo
CC libcurl_la-easyoptions.lo
CC libcurl_la-escape.lo
CC libcurl_la-file.lo
CC libcurl_la-fileinfo.lo
CC libcurl_la-formdata.lo
CC libcurl_la-ftp.lo
CC libcurl_la-ftplistparser.lo
CC libcurl_la-getenv.lo
CC libcurl_la-getinfo.lo
CC libcurl_la-gopher.lo
CC libcurl_la-hash.lo
CC libcurl_la-hmac.lo
CC libcurl_la-hostasyn.lo
CC libcurl_la-hostcheck.lo
CC libcurl_la-hostip.lo
CC libcurl_la-hostip4.lo
CC libcurl_la-hostip6.lo
CC libcurl_la-hostsyn.lo
CC libcurl_la-hsts.lo
CC libcurl_la-http.lo
CC libcurl_la-http2.lo
CC libcurl_la-http_chunks.lo
CC libcurl_la-http_digest.lo
CC libcurl_la-http_negotiate.lo
CC libcurl_la-http_ntlm.lo
CC libcurl_la-http_proxy.lo
CC libcurl_la-http_aws_sigv4.lo
CC libcurl_la-idn_win32.lo
CC libcurl_la-if2ip.lo
CC libcurl_la-imap.lo
CC libcurl_la-inet_ntop.lo
CC libcurl_la-inet_pton.lo
CC libcurl_la-krb5.lo
CC libcurl_la-ldap.lo
CC libcurl_la-llist.lo
CC libcurl_la-md4.lo
CC libcurl_la-md5.lo
CC libcurl_la-memdebug.lo
CC libcurl_la-mime.lo
CC libcurl_la-mprintf.lo
CC libcurl_la-mqtt.lo
CC libcurl_la-multi.lo
CC libcurl_la-netrc.lo
CC libcurl_la-non-ascii.lo
CC libcurl_la-nonblock.lo
CC libcurl_la-openldap.lo
CC libcurl_la-parsedate.lo
CC libcurl_la-pingpong.lo
CC libcurl_la-pop3.lo
CC libcurl_la-progress.lo
CC libcurl_la-psl.lo
CC libcurl_la-rand.lo
CC libcurl_la-rename.lo
CC libcurl_la-rtsp.lo
CC libcurl_la-select.lo
CC libcurl_la-sendf.lo
CC libcurl_la-setopt.lo
CC libcurl_la-sha256.lo
CC libcurl_la-share.lo
CC libcurl_la-slist.lo
CC libcurl_la-smb.lo
CC libcurl_la-smtp.lo
CC libcurl_la-socketpair.lo
CC libcurl_la-socks.lo
CC libcurl_la-socks_gssapi.lo
CC libcurl_la-socks_sspi.lo
CC libcurl_la-speedcheck.lo
CC libcurl_la-splay.lo
CC libcurl_la-strcase.lo
CC libcurl_la-strdup.lo
CC libcurl_la-strerror.lo
CC libcurl_la-strtok.lo
CC libcurl_la-strtoofft.lo
CC libcurl_la-system_win32.lo
CC libcurl_la-telnet.lo
CC libcurl_la-tftp.lo
CC libcurl_la-timeval.lo
CC libcurl_la-transfer.lo
CC libcurl_la-url.lo
CC libcurl_la-urlapi.lo
CC libcurl_la-version.lo
CC libcurl_la-version_win32.lo
CC libcurl_la-warnless.lo
CC libcurl_la-wildcard.lo
CC libcurl_la-x509asn1.lo
CC vauth/libcurl_la-cleartext.lo
CC vauth/libcurl_la-cram.lo
CC vauth/libcurl_la-digest.lo
CC vauth/libcurl_la-digest_sspi.lo
CC vauth/libcurl_la-gsasl.lo
CC vauth/libcurl_la-krb5_gssapi.lo
CC vauth/libcurl_la-krb5_sspi.lo
CC vauth/libcurl_la-ntlm.lo
CC vauth/libcurl_la-ntlm_sspi.lo
CC vauth/libcurl_la-oauth2.lo
CC vauth/libcurl_la-spnego_gssapi.lo
CC vauth/libcurl_la-spnego_sspi.lo
CC vauth/libcurl_la-vauth.lo
CC vtls/libcurl_la-bearssl.lo
CC vtls/libcurl_la-gskit.lo
CC vtls/libcurl_la-gtls.lo
CC vtls/libcurl_la-keylog.lo
CC vtls/libcurl_la-mbedtls.lo
CC vtls/libcurl_la-mbedtls_threadlock.lo
CC vtls/libcurl_la-mesalink.lo
CC vtls/libcurl_la-nss.lo
CC vtls/libcurl_la-openssl.lo
CC vtls/libcurl_la-rustls.lo
CC vtls/libcurl_la-schannel.lo
CC vtls/libcurl_la-schannel_verify.lo
CC vtls/libcurl_la-sectransp.lo
CC vtls/libcurl_la-vtls.lo
CC vtls/libcurl_la-wolfssl.lo
CC vquic/libcurl_la-ngtcp2.lo
CC vquic/libcurl_la-quiche.lo
CC vquic/libcurl_la-vquic.lo
CC vssh/libcurl_la-libssh.lo
CC vssh/libcurl_la-libssh2.lo
CC vssh/libcurl_la-wolfssh.lo
CCLD libcurl.la
CC libcurlu_la-altsvc.lo
CC libcurlu_la-amigaos.lo
CC libcurlu_la-asyn-ares.lo
CC libcurlu_la-asyn-thread.lo
CC libcurlu_la-base64.lo
CC libcurlu_la-bufref.lo
CC libcurlu_la-c-hyper.lo
CC libcurlu_la-conncache.lo
CC libcurlu_la-connect.lo
CC libcurlu_la-content_encoding.lo
CC libcurlu_la-cookie.lo
CC libcurlu_la-curl_addrinfo.lo
CC libcurlu_la-curl_ctype.lo
CC libcurlu_la-curl_des.lo
CC libcurlu_la-curl_endian.lo
CC libcurlu_la-curl_fnmatch.lo
CC libcurlu_la-curl_get_line.lo
CC libcurlu_la-curl_gethostname.lo
CC libcurlu_la-curl_gssapi.lo
CC libcurlu_la-curl_memrchr.lo
CC libcurlu_la-curl_multibyte.lo
CC libcurlu_la-curl_ntlm_core.lo
CC libcurlu_la-curl_ntlm_wb.lo
CC libcurlu_la-curl_path.lo
CC libcurlu_la-curl_range.lo
CC libcurlu_la-curl_rtmp.lo
CC libcurlu_la-curl_sasl.lo
CC libcurlu_la-curl_sspi.lo
CC libcurlu_la-curl_threads.lo
CC libcurlu_la-dict.lo
CC libcurlu_la-doh.lo
CC libcurlu_la-dotdot.lo
CC libcurlu_la-dynbuf.lo
CC libcurlu_la-easy.lo
CC libcurlu_la-easygetopt.lo
CC libcurlu_la-easyoptions.lo
CC libcurlu_la-escape.lo
CC libcurlu_la-file.lo
CC libcurlu_la-fileinfo.lo
CC libcurlu_la-formdata.lo
CC libcurlu_la-ftp.lo
CC libcurlu_la-ftplistparser.lo
CC libcurlu_la-getenv.lo
CC libcurlu_la-getinfo.lo
CC libcurlu_la-gopher.lo
CC libcurlu_la-hash.lo
CC libcurlu_la-hmac.lo
CC libcurlu_la-hostasyn.lo
CC libcurlu_la-hostcheck.lo
CC libcurlu_la-hostip.lo
CC libcurlu_la-hostip4.lo
CC libcurlu_la-hostip6.lo
CC libcurlu_la-hostsyn.lo
CC libcurlu_la-hsts.lo
CC libcurlu_la-http.lo
CC libcurlu_la-http2.lo
CC libcurlu_la-http_chunks.lo
CC libcurlu_la-http_digest.lo
CC libcurlu_la-http_negotiate.lo
CC libcurlu_la-http_ntlm.lo
CC libcurlu_la-http_proxy.lo
CC libcurlu_la-http_aws_sigv4.lo
CC libcurlu_la-idn_win32.lo
CC libcurlu_la-if2ip.lo
CC libcurlu_la-imap.lo
CC libcurlu_la-inet_ntop.lo
CC libcurlu_la-inet_pton.lo
CC libcurlu_la-krb5.lo
CC libcurlu_la-ldap.lo
CC libcurlu_la-llist.lo
CC libcurlu_la-md4.lo
CC libcurlu_la-md5.lo
CC libcurlu_la-memdebug.lo
CC libcurlu_la-mime.lo
CC libcurlu_la-mprintf.lo
CC libcurlu_la-mqtt.lo
CC libcurlu_la-multi.lo
CC libcurlu_la-netrc.lo
CC libcurlu_la-non-ascii.lo
CC libcurlu_la-nonblock.lo
CC libcurlu_la-openldap.lo
CC libcurlu_la-parsedate.lo
CC libcurlu_la-pingpong.lo
CC libcurlu_la-pop3.lo
CC libcurlu_la-progress.lo
CC libcurlu_la-psl.lo
CC libcurlu_la-rand.lo
CC libcurlu_la-rename.lo
CC libcurlu_la-rtsp.lo
CC libcurlu_la-select.lo
CC libcurlu_la-sendf.lo
CC libcurlu_la-setopt.lo
CC libcurlu_la-sha256.lo
CC libcurlu_la-share.lo
CC libcurlu_la-slist.lo
CC libcurlu_la-smb.lo
CC libcurlu_la-smtp.lo
CC libcurlu_la-socketpair.lo
CC libcurlu_la-socks.lo
CC libcurlu_la-socks_gssapi.lo
CC libcurlu_la-socks_sspi.lo
CC libcurlu_la-speedcheck.lo
CC libcurlu_la-splay.lo
CC libcurlu_la-strcase.lo
CC libcurlu_la-strdup.lo
CC libcurlu_la-strerror.lo
CC libcurlu_la-strtok.lo
CC libcurlu_la-strtoofft.lo
CC libcurlu_la-system_win32.lo
CC libcurlu_la-telnet.lo
CC libcurlu_la-tftp.lo
CC libcurlu_la-timeval.lo
CC libcurlu_la-transfer.lo
CC libcurlu_la-url.lo
CC libcurlu_la-urlapi.lo
CC libcurlu_la-version.lo
CC libcurlu_la-version_win32.lo
CC libcurlu_la-warnless.lo
CC libcurlu_la-wildcard.lo
CC libcurlu_la-x509asn1.lo
CC vauth/libcurlu_la-cleartext.lo
CC vauth/libcurlu_la-cram.lo
CC vauth/libcurlu_la-digest.lo
CC vauth/libcurlu_la-digest_sspi.lo
CC vauth/libcurlu_la-gsasl.lo
CC vauth/libcurlu_la-krb5_gssapi.lo
CC vauth/libcurlu_la-krb5_sspi.lo
CC vauth/libcurlu_la-ntlm.lo
CC vauth/libcurlu_la-ntlm_sspi.lo
CC vauth/libcurlu_la-oauth2.lo
CC vauth/libcurlu_la-spnego_gssapi.lo
CC vauth/libcurlu_la-spnego_sspi.lo
CC vauth/libcurlu_la-vauth.lo
CC vtls/libcurlu_la-bearssl.lo
CC vtls/libcurlu_la-gskit.lo
CC vtls/libcurlu_la-gtls.lo
CC vtls/libcurlu_la-keylog.lo
CC vtls/libcurlu_la-mbedtls.lo
CC vtls/libcurlu_la-mbedtls_threadlock.lo
CC vtls/libcurlu_la-mesalink.lo
CC vtls/libcurlu_la-nss.lo
CC vtls/libcurlu_la-openssl.lo
CC vtls/libcurlu_la-rustls.lo
CC vtls/libcurlu_la-schannel.lo
CC vtls/libcurlu_la-schannel_verify.lo
CC vtls/libcurlu_la-sectransp.lo
CC vtls/libcurlu_la-vtls.lo
CC vtls/libcurlu_la-wolfssl.lo
CC vquic/libcurlu_la-ngtcp2.lo
CC vquic/libcurlu_la-quiche.lo
CC vquic/libcurlu_la-vquic.lo
CC vssh/libcurlu_la-libssh.lo
CC vssh/libcurlu_la-libssh2.lo
CC vssh/libcurlu_la-wolfssh.lo
CCLD libcurlu.la
RUN checksrc
make[2]: Leaving directory '/build-1916/lib'
make[1]: Leaving directory '/build-1916/lib'
Making all in src
make[1]: Entering directory '/build-1916/src'
Making all in ../docs
make[2]: Entering directory '/build-1916/docs'
Making all in .
make[3]: Entering directory '/build-1916/docs'
if test "..x" != "/curl-7.77.1-20210603x" -a -e "/curl-7.77.1-20210603/docs/curl.1"; then \
/usr/bin/install -c -m 644 "/curl-7.77.1-20210603/docs/curl.1" /build-1916/docs/curl.1; fi
cd cmdline-opts && make
make[4]: Entering directory '/build-1916/docs/cmdline-opts'
make[4]: Nothing to be done for 'all'.
make[4]: Leaving directory '/build-1916/docs/cmdline-opts'
make[3]: Leaving directory '/build-1916/docs'
Making all in cmdline-opts
make[3]: Entering directory '/build-1916/docs/cmdline-opts'
make[3]: Nothing to be done for 'all'.
make[3]: Leaving directory '/build-1916/docs/cmdline-opts'
make[2]: Leaving directory '/build-1916/docs'
make[2]: Entering directory '/build-1916/src'
CC curl-slist_wc.o
CC curl-tool_binmode.o
CC curl-tool_bname.o
CC curl-tool_cb_dbg.o
CC curl-tool_cb_hdr.o
CC curl-tool_cb_prg.o
CC curl-tool_cb_rea.o
CC curl-tool_cb_see.o
CC curl-tool_cb_wrt.o
CC curl-tool_cfgable.o
CC curl-tool_convert.o
CC curl-tool_dirhie.o
CC curl-tool_doswin.o
CC curl-tool_easysrc.o
CC curl-tool_filetime.o
CC curl-tool_formparse.o
CC curl-tool_getparam.o
CC curl-tool_getpass.o
CC curl-tool_help.o
CC curl-tool_helpers.o
CC curl-tool_homedir.o
CC curl-tool_hugehelp.o
CC curl-tool_libinfo.o
CC curl-tool_main.o
CC curl-tool_metalink.o
CC curl-tool_msgs.o
CC curl-tool_operate.o
CC curl-tool_operhlp.o
CC curl-tool_panykey.o
CC curl-tool_paramhlp.o
CC curl-tool_parsecfg.o
CC curl-tool_progress.o
CC curl-tool_strdup.o
CC curl-tool_setopt.o
CC curl-tool_sleep.o
CC curl-tool_urlglob.o
CC curl-tool_util.o
CC curl-tool_vms.o
CC curl-tool_writeout.o
CC curl-tool_writeout_json.o
CC curl-tool_xattr.o
CC ../lib/curl-strtoofft.o
CC ../lib/curl-nonblock.o
CC ../lib/curl-warnless.o
CC ../lib/curl-curl_ctype.o
CC ../lib/curl-curl_multibyte.o
CC ../lib/curl-version_win32.o
CC ../lib/curl-dynbuf.o
CCLD curl.exe
CC libcurltool_la-slist_wc.lo
CC libcurltool_la-tool_binmode.lo
CC libcurltool_la-tool_bname.lo
CC libcurltool_la-tool_cb_dbg.lo
CC libcurltool_la-tool_cb_hdr.lo
CC libcurltool_la-tool_cb_prg.lo
CC libcurltool_la-tool_cb_rea.lo
CC libcurltool_la-tool_cb_see.lo
CC libcurltool_la-tool_cb_wrt.lo
CC libcurltool_la-tool_cfgable.lo
CC libcurltool_la-tool_convert.lo
CC libcurltool_la-tool_dirhie.lo
CC libcurltool_la-tool_doswin.lo
CC libcurltool_la-tool_easysrc.lo
CC libcurltool_la-tool_filetime.lo
CC libcurltool_la-tool_formparse.lo
CC libcurltool_la-tool_getparam.lo
CC libcurltool_la-tool_getpass.lo
CC libcurltool_la-tool_help.lo
CC libcurltool_la-tool_helpers.lo
CC libcurltool_la-tool_homedir.lo
CC libcurltool_la-tool_hugehelp.lo
CC libcurltool_la-tool_libinfo.lo
CC libcurltool_la-tool_main.lo
CC libcurltool_la-tool_metalink.lo
CC libcurltool_la-tool_msgs.lo
CC libcurltool_la-tool_operate.lo
CC libcurltool_la-tool_operhlp.lo
CC libcurltool_la-tool_panykey.lo
CC libcurltool_la-tool_paramhlp.lo
CC libcurltool_la-tool_parsecfg.lo
CC libcurltool_la-tool_progress.lo
CC libcurltool_la-tool_strdup.lo
CC libcurltool_la-tool_setopt.lo
CC libcurltool_la-tool_sleep.lo
CC libcurltool_la-tool_urlglob.lo
CC libcurltool_la-tool_util.lo
CC libcurltool_la-tool_vms.lo
CC libcurltool_la-tool_writeout.lo
CC libcurltool_la-tool_writeout_json.lo
CC libcurltool_la-tool_xattr.lo
CC ../lib/libcurltool_la-strtoofft.lo
CC ../lib/libcurltool_la-nonblock.lo
CC ../lib/libcurltool_la-warnless.lo
CC ../lib/libcurltool_la-curl_ctype.lo
CC ../lib/libcurltool_la-curl_multibyte.lo
CC ../lib/libcurltool_la-version_win32.lo
CC ../lib/libcurltool_la-dynbuf.lo
CCLD libcurltool.la
RUN checksrc
make[2]: Leaving directory '/build-1916/src'
make[1]: Leaving directory '/build-1916/src'
make[1]: Entering directory '/build-1916'
make[1]: Nothing to be done for 'all-am'.
make[1]: Leaving directory '/build-1916'
testcurl: libcurl was created fine (libcurl.la)
testcurl: curl was created fine (curl.exe)
testcurl: display curl.exe --version output
curl 7.77.1-20210603 (x86_64-w64-mingw32) libcurl/7.77.1-20210603 OpenSSL/1.1.1g zstd/1.4.5 libgsasl/1.8.1
Release-Date: 2021-06-03
Protocols: http https mqtt
Features: AsynchDNS Debug gsasl HSTS IPv6 Largefile SSL SSPI TLS-SRP TrackMemory zstd
testcurl: make -k TEST_F="-a -p -v !cookies !--libcurl !1056" test-full
make[1]: Entering directory '/build-1916/tests'
Making all in certs
make[2]: Entering directory '/build-1916/tests/certs'
Making all in scripts
make[3]: Entering directory '/build-1916/tests/certs/scripts'
make[3]: Nothing to be done for 'all'.
make[3]: Leaving directory '/build-1916/tests/certs/scripts'
make[3]: Entering directory '/build-1916/tests/certs'
make[3]: Nothing to be done for 'all-am'.
make[3]: Leaving directory '/build-1916/tests/certs'
make[2]: Leaving directory '/build-1916/tests/certs'
Making all in data
make[2]: Entering directory '/build-1916/tests/data'
make[2]: Nothing to be done for 'all'.
make[2]: Leaving directory '/build-1916/tests/data'
Making all in server
make[2]: Entering directory '/build-1916/tests/server'
CC ../../lib/getpart-mprintf.o
CC ../../lib/getpart-nonblock.o
CC ../../lib/getpart-strtoofft.o
CC ../../lib/getpart-warnless.o
CC ../../lib/getpart-curl_ctype.o
CC ../../lib/getpart-dynbuf.o
CC ../../lib/getpart-strdup.o
CC ../../lib/getpart-curl_multibyte.o
CC getpart-getpart.o
CC ../../lib/getpart-base64.o
CC ../../lib/getpart-memdebug.o
CC getpart-testpart.o
CCLD getpart.exe
CC ../../lib/resolve-mprintf.o
CC ../../lib/resolve-nonblock.o
CC ../../lib/resolve-strtoofft.o
CC ../../lib/resolve-warnless.o
CC ../../lib/resolve-curl_ctype.o
CC ../../lib/resolve-dynbuf.o
CC ../../lib/resolve-strdup.o
CC ../../lib/resolve-curl_multibyte.o
CC resolve-getpart.o
CC ../../lib/resolve-base64.o
CC ../../lib/resolve-memdebug.o
CC resolve-util.o
CC resolve-resolve.o
CCLD resolve.exe
CC ../../lib/rtspd-mprintf.o
CC ../../lib/rtspd-nonblock.o
CC ../../lib/rtspd-strtoofft.o
CC ../../lib/rtspd-warnless.o
CC ../../lib/rtspd-curl_ctype.o
CC ../../lib/rtspd-dynbuf.o
CC ../../lib/rtspd-strdup.o
CC ../../lib/rtspd-curl_multibyte.o
CC rtspd-getpart.o
CC ../../lib/rtspd-base64.o
CC ../../lib/rtspd-memdebug.o
CC rtspd-util.o
CC rtspd-rtspd.o
CCLD rtspd.exe
CC ../../lib/sockfilt-mprintf.o
CC ../../lib/sockfilt-nonblock.o
CC ../../lib/sockfilt-strtoofft.o
CC ../../lib/sockfilt-warnless.o
CC ../../lib/sockfilt-curl_ctype.o
CC ../../lib/sockfilt-dynbuf.o
CC ../../lib/sockfilt-strdup.o
CC ../../lib/sockfilt-curl_multibyte.o
CC sockfilt-getpart.o
CC ../../lib/sockfilt-base64.o
CC ../../lib/sockfilt-memdebug.o
CC sockfilt-util.o
CC sockfilt-sockfilt.o
CC ../../lib/sockfilt-inet_pton.o
CCLD sockfilt.exe
CC ../../lib/sws-mprintf.o
CC ../../lib/sws-nonblock.o
CC ../../lib/sws-strtoofft.o
CC ../../lib/sws-warnless.o
CC ../../lib/sws-curl_ctype.o
CC ../../lib/sws-dynbuf.o
CC ../../lib/sws-strdup.o
CC ../../lib/sws-curl_multibyte.o
CC sws-getpart.o
CC ../../lib/sws-base64.o
CC ../../lib/sws-memdebug.o
CC sws-util.o
CC sws-sws.o
CC ../../lib/sws-inet_pton.o
CCLD sws.exe
CC ../../lib/tftpd-mprintf.o
CC ../../lib/tftpd-nonblock.o
CC ../../lib/tftpd-strtoofft.o
CC ../../lib/tftpd-warnless.o
CC ../../lib/tftpd-curl_ctype.o
CC ../../lib/tftpd-dynbuf.o
CC ../../lib/tftpd-strdup.o
CC ../../lib/tftpd-curl_multibyte.o
CC tftpd-getpart.o
CC ../../lib/tftpd-base64.o
CC ../../lib/tftpd-memdebug.o
CC tftpd-util.o
CC tftpd-tftpd.o
CCLD tftpd.exe
CC ../../lib/fake_ntlm-mprintf.o
CC ../../lib/fake_ntlm-nonblock.o
CC ../../lib/fake_ntlm-strtoofft.o
CC ../../lib/fake_ntlm-warnless.o
CC ../../lib/fake_ntlm-curl_ctype.o
CC ../../lib/fake_ntlm-dynbuf.o
CC ../../lib/fake_ntlm-strdup.o
CC ../../lib/fake_ntlm-curl_multibyte.o
CC fake_ntlm-getpart.o
CC ../../lib/fake_ntlm-base64.o
CC ../../lib/fake_ntlm-memdebug.o
CC fake_ntlm-util.o
CC fake_ntlm-fake_ntlm.o
CCLD fake_ntlm.exe
CC ../../lib/socksd-mprintf.o
CC ../../lib/socksd-nonblock.o
CC ../../lib/socksd-strtoofft.o
CC ../../lib/socksd-warnless.o
CC ../../lib/socksd-curl_ctype.o
CC ../../lib/socksd-dynbuf.o
CC ../../lib/socksd-strdup.o
CC ../../lib/socksd-curl_multibyte.o
CC socksd-getpart.o
CC ../../lib/socksd-base64.o
CC ../../lib/socksd-memdebug.o
CC socksd-util.o
CC socksd-socksd.o
CC ../../lib/socksd-inet_pton.o
CCLD socksd.exe
CC disabled.o
CCLD disabled.exe
CC ../../lib/mqttd-mprintf.o
CC ../../lib/mqttd-nonblock.o
CC ../../lib/mqttd-strtoofft.o
CC ../../lib/mqttd-warnless.o
CC ../../lib/mqttd-curl_ctype.o
CC ../../lib/mqttd-dynbuf.o
CC ../../lib/mqttd-strdup.o
CC ../../lib/mqttd-curl_multibyte.o
CC mqttd-getpart.o
CC ../../lib/mqttd-base64.o
CC ../../lib/mqttd-memdebug.o
CC mqttd-util.o
CC mqttd-mqttd.o
CC ../../lib/mqttd-inet_pton.o
CCLD mqttd.exe
RUN checksrc
make[2]: Leaving directory '/build-1916/tests/server'
Making all in libtest
make[2]: Entering directory '/build-1916/tests/libtest'
CC chkhostname-chkhostname.o
CC ../../lib/chkhostname-curl_gethostname.o
CCLD chkhostname.exe
CC libauthretry-libauthretry.o
CC libauthretry-first.o
CCLD libauthretry.exe
CC libntlmconnect-libntlmconnect.o
CC libntlmconnect-first.o
CC libntlmconnect-testutil.o
CC ../../lib/libntlmconnect-warnless.o
CCLD libntlmconnect.exe
CC chkdecimalpoint-chkdecimalpoint.o
CC ../../lib/chkdecimalpoint-mprintf.o
CC ../../lib/chkdecimalpoint-curl_ctype.o
CC ../../lib/chkdecimalpoint-dynbuf.o
CC ../../lib/chkdecimalpoint-strdup.o
CCLD chkdecimalpoint.exe
CC lib500-lib500.o
CC lib500-first.o
CC lib500-testutil.o
CC lib500-testtrace.o
CC ../../lib/lib500-curl_multibyte.o
CCLD lib500.exe
CC lib501-lib501.o
CC lib501-first.o
CCLD lib501.exe
CC lib502-lib502.o
CC lib502-first.o
CC lib502-testutil.o
CC ../../lib/lib502-warnless.o
CCLD lib502.exe
CC lib503-lib503.o
CC lib503-first.o
CC lib503-testutil.o
CC ../../lib/lib503-warnless.o
CCLD lib503.exe
CC lib504-lib504.o
CC lib504-first.o
CC lib504-testutil.o
CC ../../lib/lib504-warnless.o
CCLD lib504.exe
CC lib505-lib505.o
CC lib505-first.o
CC ../../lib/lib505-curl_multibyte.o
CCLD lib505.exe
CC lib506-lib506.o
CC lib506-first.o
CCLD lib506.exe
CC lib507-lib507.o
CC lib507-first.o
CC lib507-testutil.o
CC ../../lib/lib507-warnless.o
CCLD lib507.exe
CC lib508-lib508.o
CC lib508-first.o
CCLD lib508.exe
CC lib509-lib509.o
CC lib509-first.o
CCLD lib509.exe
CC lib510-lib510.o
CC lib510-first.o
CCLD lib510.exe
CC lib511-lib511.o
CC lib511-first.o
CCLD lib511.exe
CC lib512-lib512.o
CC lib512-first.o
CCLD lib512.exe
CC lib513-lib513.o
CC lib513-first.o
CCLD lib513.exe
CC lib514-lib514.o
CC lib514-first.o
CCLD lib514.exe
CC lib515-lib515.o
CC lib515-first.o
CCLD lib515.exe
CC lib516-lib516.o
CC lib516-first.o
CCLD lib516.exe
CC lib517-lib517.o
CC lib517-first.o
CCLD lib517.exe
CC lib518-lib518.o
CC lib518-first.o
CC ../../lib/lib518-warnless.o
CC ../../lib/lib518-curl_multibyte.o
CCLD lib518.exe
CC lib519-lib519.o
CC lib519-first.o
CCLD lib519.exe
CC lib520-lib520.o
CC lib520-first.o
CCLD lib520.exe
CC lib521-lib521.o
CC lib521-first.o
CCLD lib521.exe
CC lib523-lib523.o
CC lib523-first.o
CCLD lib523.exe
CC lib524-lib524.o
CC lib524-first.o
CCLD lib524.exe
CC lib525-lib525.o
CC lib525-first.o
CC lib525-testutil.o
CC ../../lib/lib525-warnless.o
CC ../../lib/lib525-curl_multibyte.o
CCLD lib525.exe
CC lib526-lib526.o
CC lib526-first.o
CC lib526-testutil.o
CC ../../lib/lib526-warnless.o
CCLD lib526.exe
CC lib527-lib526.o
CC lib527-first.o
CC lib527-testutil.o
CC ../../lib/lib527-warnless.o
CCLD lib527.exe
CC lib529-lib525.o
CC lib529-first.o
CC lib529-testutil.o
CC ../../lib/lib529-warnless.o
CC ../../lib/lib529-curl_multibyte.o
CCLD lib529.exe
CC lib532-lib526.o
CC lib532-first.o
CC lib532-testutil.o
CC ../../lib/lib532-warnless.o
CCLD lib532.exe
CC lib533-lib533.o
CC lib533-first.o
CC lib533-testutil.o
CC ../../lib/lib533-warnless.o
CCLD lib533.exe
CC lib537-lib537.o
CC lib537-first.o
CC ../../lib/lib537-warnless.o
CC ../../lib/lib537-curl_multibyte.o
CCLD lib537.exe
CC lib539-lib539.o
CC lib539-first.o
CCLD lib539.exe
CC lib540-lib540.o
CC lib540-first.o
CC lib540-testutil.o
CC ../../lib/lib540-warnless.o
CCLD lib540.exe
CC lib541-lib541.o
CC lib541-first.o
CC ../../lib/lib541-curl_multibyte.o
CCLD lib541.exe
CC lib542-lib542.o
CC lib542-first.o
CCLD lib542.exe
CC lib543-lib543.o
CC lib543-first.o
CCLD lib543.exe
CC lib544-lib544.o
CC lib544-first.o
CCLD lib544.exe
CC lib545-lib544.o
CC lib545-first.o
CCLD lib545.exe
CC lib547-lib547.o
CC lib547-first.o
CCLD lib547.exe
CC lib548-lib547.o
CC lib548-first.o
CCLD lib548.exe
CC lib549-lib549.o
CC lib549-first.o
CCLD lib549.exe
CC lib552-lib552.o
CC lib552-first.o
CC ../../lib/lib552-warnless.o
CCLD lib552.exe
CC lib553-lib553.o
CC lib553-first.o
CCLD lib553.exe
CC lib554-lib554.o
CC lib554-first.o
CCLD lib554.exe
CC lib555-lib555.o
CC lib555-first.o
CC lib555-testutil.o
CC ../../lib/lib555-warnless.o
CCLD lib555.exe
CC lib556-lib556.o
CC lib556-first.o
CC ../../lib/lib556-warnless.o
CCLD lib556.exe
CC lib557-lib557.o
CC lib557-first.o
CCLD lib557.exe
CC lib558-lib558.o
CC lib558-first.o
CCLD lib558.exe
CC lib559-lib559.o
CC lib559-first.o
CCLD lib559.exe
CC lib560-lib560.o
CC lib560-first.o
CC lib560-testutil.o
CC ../../lib/lib560-warnless.o
CCLD lib560.exe
CC lib562-lib562.o
CC lib562-first.o
CCLD lib562.exe
CC lib564-lib564.o
CC lib564-first.o
CC lib564-testutil.o
CC ../../lib/lib564-warnless.o
CCLD lib564.exe
CC lib565-lib510.o
CC lib565-first.o
CCLD lib565.exe
CC lib566-lib566.o
CC lib566-first.o
CC ../../lib/lib566-curl_multibyte.o
CCLD lib566.exe
CC lib567-lib567.o
CC lib567-first.o
CCLD lib567.exe
CC lib568-lib568.o
CC lib568-first.o
CC ../../lib/lib568-curl_multibyte.o
CCLD lib568.exe
CC lib569-lib569.o
CC lib569-first.o
CC ../../lib/lib569-curl_multibyte.o
CCLD lib569.exe
CC lib570-lib570.o
CC lib570-first.o
CCLD lib570.exe
CC lib571-lib571.o
CC lib571-first.o
CC ../../lib/lib571-warnless.o
CC ../../lib/lib571-curl_multibyte.o
CCLD lib571.exe
CC lib572-lib572.o
CC lib572-first.o
CC ../../lib/lib572-curl_multibyte.o
CCLD lib572.exe
CC lib573-lib573.o
CC lib573-first.o
CC lib573-testutil.o
CC ../../lib/lib573-warnless.o
CC lib573-testtrace.o
CCLD lib573.exe
CC lib574-lib574.o
CC lib574-first.o
CCLD lib574.exe
CC lib575-lib575.o
CC lib575-first.o
CC lib575-testutil.o
CC ../../lib/lib575-warnless.o
CCLD lib575.exe
CC lib576-lib576.o
CC lib576-first.o
CCLD lib576.exe
CC lib578-lib578.o
CC lib578-first.o
CC ../../lib/lib578-curl_multibyte.o
CCLD lib578.exe
CC lib579-lib579.o
CC lib579-first.o
CC ../../lib/lib579-curl_multibyte.o
CCLD lib579.exe
CC lib582-lib582.o
CC lib582-first.o
CC lib582-testutil.o
CC ../../lib/lib582-warnless.o
CC ../../lib/lib582-curl_multibyte.o
CCLD lib582.exe
CC lib583-lib583.o
CC lib583-first.o
CCLD lib583.exe
CC lib584-lib589.o
CC lib584-first.o
CCLD lib584.exe
CC lib585-lib500.o
CC lib585-first.o
CC lib585-testutil.o
CC lib585-testtrace.o
CC ../../lib/lib585-curl_multibyte.o
CCLD lib585.exe
CC lib586-lib586.o
CC lib586-first.o
CCLD lib586.exe
CC lib587-lib554.o
CC lib587-first.o
CCLD lib587.exe
CC lib589-lib589.o
CC lib589-first.o
CCLD lib589.exe
CC lib590-lib590.o
CC lib590-first.o
CCLD lib590.exe
CC lib591-lib591.o
CC lib591-first.o
CC lib591-testutil.o
CC ../../lib/lib591-warnless.o
CC ../../lib/lib591-curl_multibyte.o
CCLD lib591.exe
CC lib597-lib597.o
CC lib597-first.o
CC lib597-testutil.o
CC ../../lib/lib597-warnless.o
CCLD lib597.exe
CC lib598-lib598.o
CC lib598-first.o
CCLD lib598.exe
CC lib599-lib599.o
CC lib599-first.o
CC ../../lib/lib599-curl_multibyte.o
CCLD lib599.exe
CC lib643-lib643.o
CC lib643-first.o
CCLD lib643.exe
CC lib644-lib643.o
CC lib644-first.o
CCLD lib644.exe
CC lib645-lib643.o
CC lib645-first.o
CCLD lib645.exe
CC lib650-lib650.o
CC lib650-first.o
CCLD lib650.exe
CC lib651-lib651.o
CC lib651-first.o
CCLD lib651.exe
CC lib652-lib652.o
CC lib652-first.o
CCLD lib652.exe
CC lib653-lib653.o
CC lib653-first.o
CCLD lib653.exe
CC lib654-lib654.o
CC lib654-first.o
CCLD lib654.exe
CC lib655-lib655.o
CC lib655-first.o
CCLD lib655.exe
CC lib658-lib658.o
CC lib658-first.o
CC lib658-testutil.o
CC ../../lib/lib658-warnless.o
CCLD lib658.exe
CC lib659-lib659.o
CC lib659-first.o
CC lib659-testutil.o
CC ../../lib/lib659-warnless.o
CCLD lib659.exe
CC lib661-lib661.o
CC lib661-first.o
CCLD lib661.exe
CC lib666-lib666.o
CC lib666-first.o
CCLD lib666.exe
CC lib667-lib667.o
CC lib667-first.o
CC lib667-testutil.o
CC ../../lib/lib667-warnless.o
CCLD lib667.exe
CC lib668-lib668.o
CC lib668-first.o
CC lib668-testutil.o
CC ../../lib/lib668-warnless.o
CCLD lib668.exe
CC lib670-lib670.o
CC lib670-first.o
CC lib670-testutil.o
CC ../../lib/lib670-warnless.o
CCLD lib670.exe
CC lib671-lib670.o
CC lib671-first.o
CC lib671-testutil.o
CC ../../lib/lib671-warnless.o
CCLD lib671.exe
CC lib672-lib670.o
CC lib672-first.o
CC lib672-testutil.o
CC ../../lib/lib672-warnless.o
CCLD lib672.exe
CC lib673-lib670.o
CC lib673-first.o
CC lib673-testutil.o
CC ../../lib/lib673-warnless.o
CCLD lib673.exe
CC lib674-lib674.o
CC lib674-first.o
CC lib674-testutil.o
CC ../../lib/lib674-warnless.o
CCLD lib674.exe
CC lib676-lib676.o
CC lib676-first.o
CC lib676-testutil.o
CC ../../lib/lib676-warnless.o
CCLD lib676.exe
CC lib678-lib678.o
CC lib678-first.o
CC lib678-testutil.o
CC ../../lib/lib678-warnless.o
CC ../../lib/lib678-curl_multibyte.o
CCLD lib678.exe
CC lib1156-lib1156.o
CC lib1156-first.o
CC lib1156-testutil.o
CC ../../lib/lib1156-warnless.o
CCLD lib1156.exe
CC lib1500-lib1500.o
CC lib1500-first.o
CC lib1500-testutil.o
CCLD lib1500.exe
CC lib1501-lib1501.o
CC lib1501-first.o
CC lib1501-testutil.o
CC ../../lib/lib1501-warnless.o
CCLD lib1501.exe
CC lib1502-lib1502.o
CC lib1502-first.o
CC lib1502-testutil.o
CC ../../lib/lib1502-warnless.o
CCLD lib1502.exe
CC lib1503-lib1502.o
CC lib1503-first.o
CC lib1503-testutil.o
CC ../../lib/lib1503-warnless.o
CCLD lib1503.exe
CC lib1504-lib1502.o
CC lib1504-first.o
CC lib1504-testutil.o
CC ../../lib/lib1504-warnless.o
CCLD lib1504.exe
CC lib1505-lib1502.o
CC lib1505-first.o
CC lib1505-testutil.o
CC ../../lib/lib1505-warnless.o
CCLD lib1505.exe
CC lib1506-lib1506.o
CC lib1506-first.o
CC lib1506-testutil.o
CC ../../lib/lib1506-warnless.o
CCLD lib1506.exe
CC lib1507-lib1507.o
CC lib1507-first.o
CC lib1507-testutil.o
CC ../../lib/lib1507-warnless.o
CCLD lib1507.exe
CC lib1508-lib1508.o
CC lib1508-first.o
CC lib1508-testutil.o
CC ../../lib/lib1508-warnless.o
CCLD lib1508.exe
CC lib1509-lib1509.o
CC lib1509-first.o
CC lib1509-testutil.o
CC ../../lib/lib1509-warnless.o
CCLD lib1509.exe
CC lib1510-lib1510.o
CC lib1510-first.o
CC lib1510-testutil.o
CC ../../lib/lib1510-warnless.o
CCLD lib1510.exe
CC lib1511-lib1511.o
CC lib1511-first.o
CC lib1511-testutil.o
CC ../../lib/lib1511-warnless.o
CCLD lib1511.exe
CC lib1512-lib1512.o
CC lib1512-first.o
CC lib1512-testutil.o
CC ../../lib/lib1512-warnless.o
CCLD lib1512.exe
CC lib1513-lib1513.o
CC lib1513-first.o
CC lib1513-testutil.o
CC ../../lib/lib1513-warnless.o
CCLD lib1513.exe
CC lib1514-lib1514.o
CC lib1514-first.o
CC lib1514-testutil.o
CC ../../lib/lib1514-warnless.o
CCLD lib1514.exe
CC lib1515-lib1515.o
CC lib1515-first.o
CC lib1515-testutil.o
CC ../../lib/lib1515-warnless.o
CCLD lib1515.exe
CC lib1517-lib1517.o
CC lib1517-first.o
CCLD lib1517.exe
CC lib1518-lib1518.o
CC lib1518-first.o
CCLD lib1518.exe
CC lib1520-lib1520.o
CC lib1520-first.o
CCLD lib1520.exe
/usr/bin/perl /curl-7.77.1-20210603/tests/libtest/mk-lib1521.pl < /curl-7.77.1-20210603/include/curl/curl.h > lib1521.c
CC lib1521-lib1521.o
CC lib1521-first.o
CCLD lib1521.exe
CC lib1522-lib1522.o
CC lib1522-first.o
CC lib1522-testutil.o
CC lib1522-testtrace.o
CCLD lib1522.exe
CC lib1523-lib1523.o
CC lib1523-first.o
CCLD lib1523.exe
CC lib1525-lib1525.o
CC lib1525-first.o
CC lib1525-testutil.o
CC ../../lib/lib1525-warnless.o
CCLD lib1525.exe
CC lib1526-lib1526.o
CC lib1526-first.o
CC lib1526-testutil.o
CC ../../lib/lib1526-warnless.o
CCLD lib1526.exe
CC lib1527-lib1527.o
CC lib1527-first.o
CC lib1527-testutil.o
CC ../../lib/lib1527-warnless.o
CCLD lib1527.exe
CC lib1528-lib1528.o
CC lib1528-first.o
CC lib1528-testutil.o
CC ../../lib/lib1528-warnless.o
CCLD lib1528.exe
CC lib1529-lib1529.o
CC lib1529-first.o
CC lib1529-testutil.o
CC ../../lib/lib1529-warnless.o
CCLD lib1529.exe
CC lib1530-lib1530.o
CC lib1530-first.o
CC lib1530-testutil.o
CC ../../lib/lib1530-warnless.o
CCLD lib1530.exe
CC lib1531-lib1531.o
CC lib1531-first.o
CC lib1531-testutil.o
CC ../../lib/lib1531-warnless.o
CCLD lib1531.exe
CC lib1532-lib1532.o
CC lib1532-first.o
CC lib1532-testutil.o
CC ../../lib/lib1532-warnless.o
CCLD lib1532.exe
CC lib1533-lib1533.o
CC lib1533-first.o
CC lib1533-testutil.o
CC ../../lib/lib1533-warnless.o
CCLD lib1533.exe
CC lib1534-lib1534.o
CC lib1534-first.o
CC lib1534-testutil.o
CC ../../lib/lib1534-warnless.o
CCLD lib1534.exe
CC lib1535-lib1535.o
CC lib1535-first.o
CC lib1535-testutil.o
CC ../../lib/lib1535-warnless.o
CCLD lib1535.exe
CC lib1536-lib1536.o
CC lib1536-first.o
CC lib1536-testutil.o
CC ../../lib/lib1536-warnless.o
CCLD lib1536.exe
CC lib1537-lib1537.o
CC lib1537-first.o
CC lib1537-testutil.o
CC ../../lib/lib1537-warnless.o
CCLD lib1537.exe
CC lib1538-lib1538.o
CC lib1538-first.o
CC lib1538-testutil.o
CC ../../lib/lib1538-warnless.o
CCLD lib1538.exe
CC lib1539-lib1514.o
CC lib1539-first.o
CC lib1539-testutil.o
CC ../../lib/lib1539-warnless.o
CCLD lib1539.exe
CC lib1540-lib1540.o
CC lib1540-first.o
CC lib1540-testutil.o
CC ../../lib/lib1540-warnless.o
CCLD lib1540.exe
CC lib1550-lib1550.o
CC lib1550-first.o
CCLD lib1550.exe
CC lib1551-lib1551.o
CC lib1551-first.o
CCLD lib1551.exe
CC lib1552-lib1552.o
CC lib1552-first.o
CC lib1552-testutil.o
CCLD lib1552.exe
CC lib1553-lib1553.o
CC lib1553-first.o
CC lib1553-testutil.o
CCLD lib1553.exe
CC lib1554-lib1554.o
CC lib1554-first.o
CCLD lib1554.exe
CC lib1555-lib1555.o
CC lib1555-first.o
CC lib1555-testutil.o
CC ../../lib/lib1555-warnless.o
CCLD lib1555.exe
CC lib1556-lib1556.o
CC lib1556-first.o
CC lib1556-testutil.o
CC ../../lib/lib1556-warnless.o
CCLD lib1556.exe
CC lib1557-lib1557.o
CC lib1557-first.o
CC lib1557-testutil.o
CC ../../lib/lib1557-warnless.o
CCLD lib1557.exe
CC lib1558.o
CC first.o
CC testutil.o
CC ../../lib/warnless.o
CCLD lib1558.exe
CC lib1559.o
CCLD lib1559.exe
CC lib1560.o
CCLD lib1560.exe
CC lib1564-lib1564.o
CC lib1564-first.o
CC lib1564-testutil.o
CC ../../lib/lib1564-warnless.o
CCLD lib1564.exe
CC lib1565-lib1565.o
CC lib1565-first.o
CC lib1565-testutil.o
CC ../../lib/lib1565-warnless.o
CCLD lib1565.exe
CC lib1567-lib1567.o
CC lib1567-first.o
CCLD lib1567.exe
CC lib1568-lib1568.o
CC lib1568-first.o
CCLD lib1568.exe
CC lib1569-lib1569.o
CC lib1569-first.o
CCLD lib1569.exe
CC lib1591-lib1591.o
CC lib1591-first.o
CC lib1591-testutil.o
CC ../../lib/lib1591-warnless.o
CCLD lib1591.exe
CC lib1592-lib1592.o
CC lib1592-first.o
CC lib1592-testutil.o
CC ../../lib/lib1592-warnless.o
CCLD lib1592.exe
CC lib1593.o
CCLD lib1593.exe
CC lib1594.o
CCLD lib1594.exe
CC lib1596-lib1594.o
CC lib1596-first.o
CC lib1596-testutil.o
CC ../../lib/lib1596-warnless.o
CCLD lib1596.exe
CC lib1905-lib1905.o
CC lib1905-first.o
CC lib1905-testutil.o
CC ../../lib/lib1905-warnless.o
CCLD lib1905.exe
CC lib1906-lib1906.o
CC lib1906-first.o
CC lib1906-testutil.o
CC ../../lib/lib1906-warnless.o
CCLD lib1906.exe
CC lib1907-lib1907.o
CC lib1907-first.o
CC lib1907-testutil.o
CC ../../lib/lib1907-warnless.o
CCLD lib1907.exe
CC lib1908-lib1908.o
CC lib1908-first.o
CC lib1908-testutil.o
CC ../../lib/lib1908-warnless.o
CCLD lib1908.exe
CC lib1910-lib1910.o
CC lib1910-first.o
CC lib1910-testutil.o
CC ../../lib/lib1910-warnless.o
CCLD lib1910.exe
CC lib1911-lib1911.o
CC lib1911-first.o
CC lib1911-testutil.o
CC ../../lib/lib1911-warnless.o
CCLD lib1911.exe
CC lib1912-lib1912.o
CC lib1912-first.o
CC lib1912-testutil.o
CC ../../lib/lib1912-warnless.o
CCLD lib1912.exe
CC lib1913-lib1913.o
CC lib1913-first.o
CC lib1913-testutil.o
CC ../../lib/lib1913-warnless.o
CCLD lib1913.exe
CC lib1915-lib1915.o
CC lib1915-first.o
CC lib1915-testutil.o
CC ../../lib/lib1915-warnless.o
CCLD lib1915.exe
CC lib1916-lib1916.o
CC lib1916-first.o
CC ../../lib/lib1916-warnless.o
CCLD lib1916.exe
CC lib1917-lib1916.o
CC lib1917-first.o
CC ../../lib/lib1917-warnless.o
CCLD lib1917.exe
CC lib1918-lib1918.o
CC lib1918-first.o
CC ../../lib/lib1918-warnless.o
CCLD lib1918.exe
CC lib1933-lib1933.o
CC lib1933-first.o
CC lib1933-testutil.o
CC ../../lib/lib1933-warnless.o
CCLD lib1933.exe
CC lib1934-lib1934.o
CC lib1934-first.o
CC lib1934-testutil.o
CC ../../lib/lib1934-warnless.o
CCLD lib1934.exe
CC lib1935-lib1935.o
CC lib1935-first.o
CC lib1935-testutil.o
CC ../../lib/lib1935-warnless.o
CCLD lib1935.exe
CC lib1936-lib1936.o
CC lib1936-first.o
CC lib1936-testutil.o
CC ../../lib/lib1936-warnless.o
CCLD lib1936.exe
CC lib3010-lib3010.o
CC lib3010-first.o
CC lib3010-testutil.o
CC ../../lib/lib3010-warnless.o
CCLD lib3010.exe
RUN checksrc
make[2]: Leaving directory '/build-1916/tests/libtest'
Making all in unit
make[2]: Entering directory '/build-1916/tests/unit'
CC unit1300-unit1300.o
CC ../libtest/unit1300-first.o
CCLD unit1300.exe
CC unit1301-unit1301.o
CC ../libtest/unit1301-first.o
CCLD unit1301.exe
CC unit1302-unit1302.o
CC ../libtest/unit1302-first.o
CCLD unit1302.exe
CC unit1303-unit1303.o
CC ../libtest/unit1303-first.o
CCLD unit1303.exe
CC unit1304-unit1304.o
CC ../libtest/unit1304-first.o
CCLD unit1304.exe
CC unit1305-unit1305.o
CC ../libtest/unit1305-first.o
CCLD unit1305.exe
CC unit1307-unit1307.o
CC ../libtest/unit1307-first.o
CCLD unit1307.exe
CC unit1308-unit1308.o
CC ../libtest/unit1308-first.o
CCLD unit1308.exe
CC unit1309-unit1309.o
CC ../libtest/unit1309-first.o
CCLD unit1309.exe
CC unit1323-unit1323.o
CC ../libtest/unit1323-first.o
CCLD unit1323.exe
CC unit1330-unit1330.o
CC ../libtest/unit1330-first.o
CCLD unit1330.exe
CC unit1394-unit1394.o
CC ../libtest/unit1394-first.o
CCLD unit1394.exe
CC unit1395-unit1395.o
CC ../libtest/unit1395-first.o
CCLD unit1395.exe
CC unit1396-unit1396.o
CC ../libtest/unit1396-first.o
CCLD unit1396.exe
CC unit1397-unit1397.o
CC ../libtest/unit1397-first.o
CCLD unit1397.exe
CC unit1398-unit1398.o
CC ../libtest/unit1398-first.o
CCLD unit1398.exe
CC unit1399-unit1399.o
CC ../libtest/unit1399-first.o
CCLD unit1399.exe
CC unit1600-unit1600.o
CC ../libtest/unit1600-first.o
CCLD unit1600.exe
CC unit1601-unit1601.o
CC ../libtest/unit1601-first.o
CCLD unit1601.exe
CC unit1602-unit1602.o
CC ../libtest/unit1602-first.o
CCLD unit1602.exe
CC unit1603-unit1603.o
CC ../libtest/unit1603-first.o
CCLD unit1603.exe
CC unit1604-unit1604.o
CC ../libtest/unit1604-first.o
CCLD unit1604.exe
CC unit1605-unit1605.o
CC ../libtest/unit1605-first.o
CCLD unit1605.exe
CC unit1606-unit1606.o
CC ../libtest/unit1606-first.o
CCLD unit1606.exe
CC unit1607-unit1607.o
CC ../libtest/unit1607-first.o
CCLD unit1607.exe
CC unit1608-unit1608.o
CC ../libtest/unit1608-first.o
CCLD unit1608.exe
CC unit1609-unit1609.o
CC ../libtest/unit1609-first.o
CCLD unit1609.exe
CC unit1610-unit1610.o
CC ../libtest/unit1610-first.o
CCLD unit1610.exe
CC unit1611-unit1611.o
CC ../libtest/unit1611-first.o
CCLD unit1611.exe
CC unit1612-unit1612.o
CC ../libtest/unit1612-first.o
CCLD unit1612.exe
CC unit1620-unit1620.o
CC ../libtest/unit1620-first.o
CCLD unit1620.exe
CC unit1621-unit1621.o
CC ../libtest/unit1621-first.o
CCLD unit1621.exe
CC unit1650-unit1650.o
CC ../libtest/unit1650-first.o
CCLD unit1650.exe
CC unit1651-unit1651.o
CC ../libtest/unit1651-first.o
CCLD unit1651.exe
CC unit1652-unit1652.o
CC ../libtest/unit1652-first.o
CCLD unit1652.exe
CC unit1653-unit1653.o
CC ../libtest/unit1653-first.o
CCLD unit1653.exe
CC unit1654-unit1654.o
CC ../libtest/unit1654-first.o
CCLD unit1654.exe
CC unit1655-unit1655.o
CC ../libtest/unit1655-first.o
CCLD unit1655.exe
CC unit1660-unit1660.o
CC ../libtest/unit1660-first.o
CCLD unit1660.exe
CC unit1661-unit1661.o
CC ../libtest/unit1661-first.o
CCLD unit1661.exe
make[2]: Leaving directory '/build-1916/tests/unit'
make[2]: Entering directory '/build-1916/tests'
cd libtest && make checksrc
make[3]: Entering directory '/build-1916/tests/libtest'
RUN checksrc
make[3]: Leaving directory '/build-1916/tests/libtest'
cd unit && make checksrc
make[3]: Entering directory '/build-1916/tests/unit'
RUN checksrc
make[3]: Leaving directory '/build-1916/tests/unit'
cd server && make checksrc
make[3]: Entering directory '/build-1916/tests/server'
RUN checksrc
make[3]: Leaving directory '/build-1916/tests/server'
make[2]: Leaving directory '/build-1916/tests'
srcdir=/curl-7.77.1-20210603/tests /usr/bin/perl -I/curl-7.77.1-20210603/tests /curl-7.77.1-20210603/tests/runtests.pl -a -p -v !cookies !--libcurl !1056
CMD (0): ../src/curl.exe --version 1>log/curlverout.log 2>log/curlvererr.log
goto problem 2
Use of uninitialized value $sws[0] in pattern match (m//) at /curl-7.77.1-20210603/tests/runtests.pl line 3201.
********* System characteristics ********
* curl 7.77.1-20210603 (x86_64-w64-mingw32)
* libcurl/7.77.1-20210603 OpenSSL/1.1.1g zstd/1.4.5 libgsasl/1.8.1
* Features: AsynchDNS Debug gsasl HSTS IPv6 Largefile SSL SSPI TLS-SRP TrackMemory zstd
* Disabled: cookies, crypto, DoH, proxy
* Host: DEVSRVFRA0013
* System: MINGW64_NT-10.0-17763 DEVSRVFRA0013 3.1.6-340.x86_64 2020-08-14 15:42 UTC x86_64 Msys
* OS: msys
*
*** DISABLES memory tracking when using threaded resolver
*
* Servers: FTP-IPv6
* Env:
* Seed: 250654
*****************************************
DISABLED: test 323
DISABLED: test 594
DISABLED: test 836
DISABLED: test 882
DISABLED: test 938
DISABLED: test 1182
DISABLED: test 1209
DISABLED: test 1211
DISABLED: test 1307
DISABLED: test 1316
DISABLED: test 1510
DISABLED: test 1512
DISABLED: test 1801
startnew: perl -I/curl-7.77.1-20210603/tests /curl-7.77.1-20210603/tests/httpserver.pl --pidfile ".http_server.pid" --logfile "log/http_server.log" --portfile .http_server.port --ipv4 --port 0 --srcdir "/curl-7.77.1-20210603/tests/data/.."
startnew: child process has died, server might start up
RUN: failed to start the HTTP server
== Contents of files in the log/ dir after test 1
test 0001 SKIPPED: failed starting HTTP server
test 0002 SKIPPED: failed starting HTTP server
test 0003 SKIPPED: failed starting HTTP server
test 0005 SKIPPED: curl lacks proxy support
test 0006 SKIPPED: disabled by keyword
test 0007 SKIPPED: disabled by keyword
test 0008 SKIPPED: disabled by keyword
test 0016 SKIPPED: curl lacks proxy support
* starts no server
test 0019...[attempt connect to non-listening socket]
../src/curl.exe --output log/curl19.out --include --trace-ascii log/trace19 --trace-time 127.0.0.1:47 >log/stdout19 2>log/stderr19
CMD (1792): ../src/curl.exe --output log/curl19.out --include --trace-ascii log/trace19 --trace-time 127.0.0.1:47 >log/stdout19 2>log/stderr19
-------e--- OK (19 out of 1415, remaining: 08:06, took 1.262s, duration: 00:06)
* starts no server
test 0020...[attempt connect to non-existing host name]
../src/curl.exe --output log/curl20.out --include --trace-ascii log/trace20 --trace-time --ipv4 non-existing-host.haxx.se. >log/stdout20 2>log/stderr20
CMD (1536): ../src/curl.exe --output log/curl20.out --include --trace-ascii log/trace20 --trace-time --ipv4 non-existing-host.haxx.se. >log/stdout20 2>log/stderr20
-------e--- OK (20 out of 1415, remaining: 08:04, took 0.320s, duration: 00:06)
setenv TZ = GMT
test 0043 SKIPPED: curl lacks proxy support
setenv TZ = GMT
setenv TZ = GMT
setenv http_proxy = http://fake:user@127.0.0.1:0/
test 0064 SKIPPED: curl lacks crypto support
test 0065 SKIPPED: curl lacks crypto support
setenv CURL_GETHOSTNAME = curlhost
test 0067 SKIPPED: curl lacks NTLM support
setenv CURL_GETHOSTNAME = curlhost
test 0068 SKIPPED: curl lacks NTLM support
setenv CURL_GETHOSTNAME = curlhost
test 0069 SKIPPED: curl lacks NTLM support
test 0072 SKIPPED: curl lacks crypto support
* starts no server
test 0075...[HTTP, urlglob retrieval with bad range]
../src/curl.exe --include --trace-ascii log/trace75 --trace-time "http://a-site-never-accessed.example.org/[2-1]" -o "log/weee#1.dump" --stderr - >log/stdout75 2>log/stderr75
CMD (768): ../src/curl.exe --include --trace-ascii log/trace75 --trace-time "http://a-site-never-accessed.example.org/[2-1]" -o "log/weee#1.dump" --stderr - >log/stdout75 2>log/stderr75
s------e--- OK (75 out of 1415, remaining: 02:24, took 0.215s, duration: 00:08)
* starts no server
test 0076...[HTTP, -O with no file name part in the URL]
../src/curl.exe --include --trace-ascii log/trace76 --trace-time http://127.0.0.1:47/76/ -O >log/stdout76 2>log/stderr76
CMD (5888): ../src/curl.exe --include --trace-ascii log/trace76 --trace-time http://127.0.0.1:47/76/ -O >log/stdout76 2>log/stderr76
-------e--- OK (76 out of 1415, remaining: 02:26, took 0.211s, duration: 00:08)
test 0079 SKIPPED: curl lacks ftp support
setenv CURL_GETHOSTNAME = curlhost
setenv CURL_GETHOSTNAME = curlhost
setenv CURL_GETHOSTNAME = curlhost
setenv CURL_GETHOSTNAME = curlhost
test 0096 SKIPPED: curl lacks TrackMemory support
test 0100 SKIPPED: curl lacks ftp server support
test 0101 SKIPPED: curl lacks ftp server support
test 0102 SKIPPED: curl lacks ftp server support
setenv CURL_GETHOSTNAME = curlhost
setenv CURL_GETHOSTNAME = curlhost
setenv CURL_GETHOSTNAME = curlhost
setenv LC_ALL = en_US.UTF-8
setenv LC_CTYPE = en_US.UTF-8
test 0165 SKIPPED: curl lacks idn support
setenv CURL_GETHOSTNAME = curlhost
test 0200 SKIPPED: curl lacks file server support
test 0201 SKIPPED: curl lacks file server support
test 0202 SKIPPED: curl lacks file server support
setenv MSYS2_ARG_CONV_EXCL = file:
test 0208 SKIPPED: curl lacks ftp support
setenv CURL_GETHOSTNAME = curlhost
setenv CURL_GETHOSTNAME = curlhost
setenv MSYS2_ARG_CONV_EXCL = http://
test 0220 SKIPPED: curl lacks libz support
test 0221 SKIPPED: curl lacks libz support
test 0222 SKIPPED: curl lacks libz support
setenv CURL_GETHOSTNAME = curlhost
startnew: perl -I/curl-7.77.1-20210603/tests /curl-7.77.1-20210603/tests/httpserver.pl --pidfile ".http_ipv6_server.pid" --logfile "log/http_ipv6_server.log" --portfile .http_ipv6_server.port --ipv6 --port 0 --srcdir "/curl-7.77.1-20210603/tests/data/.."
startnew: child process has died, server might start up
RUN: failed to start the HTTP-IPv6 server
== Contents of files in the log/ dir after test 240
test 0240 SKIPPED: failed starting HTTP-IPv6 server
test 0241 SKIPPED: failed starting HTTP-IPv6 server
test 0242 SKIPPED: failed starting HTTP-IPv6 server
setenv CURL_GETHOSTNAME = curlhost
test 0252 SKIPPED: curl lacks ftp-ipv6 server support
test 0253 SKIPPED: curl lacks ftp-ipv6 server support
test 0254 SKIPPED: curl lacks ftp-ipv6 server support
setenv CURL_GETHOSTNAME = curlhost
setenv CURL_GETHOSTNAME = curlhost
test 0271 SKIPPED: curl lacks tftp server support
test 0283 SKIPPED: curl lacks tftp server support
test 0284 SKIPPED: curl lacks tftp server support
setenv all_proxy = http://fake:user@127.0.0.1:47/
test 0288 SKIPPED: curl lacks file support
test 0299 SKIPPED: curl lacks ftp support
test 0300 SKIPPED: no stunnel
test 0301 SKIPPED: no stunnel
test 0303 SKIPPED: no stunnel
test 0314 SKIPPED: curl lacks brotli support
test 0315 SKIPPED: curl lacks brotli support
test 0316 SKIPPED: curl lacks brotli support
startnew: /mingw64/bin/gnutls-serv.exe --port 24569 --http --priority NORMAL:+SRP --srppasswd /curl-7.77.1-20210603/tests/certs/srp-verifier-db --srppasswdconf /curl-7.77.1-20210603/tests/certs/srp-verifier-conf > log/httptls_server.log 2>&1
startnew: .httptls_server.pid faked with pid=33655
RUN: HTTPTLS server PID 33655 port 24569
* pid httptls => 33655 33655
test 0320...[simple TLS-SRP HTTPS GET, check user in response]
../src/curl.exe --output log/curl320.out --include --trace-ascii log/trace320 --trace-time --insecure --tlsauthtype SRP --tlsuser jsmith --tlspassword abc -A curl-test-suite https://127.0.0.1:24569 >log/stdout320 2>log/stderr320
CMD (8960): ../src/curl.exe --output log/curl320.out --include --trace-ascii log/trace320 --trace-time --insecure --tlsauthtype SRP --tlsuser jsmith --tlspassword abc -A curl-test-suite https://127.0.0.1:24569 >log/stdout320 2>log/stderr320

goto problem 3
320: output (log/curl320.out) FAILED:
--- log/check-expected 2021-06-03 06:11:07.260879000 +0100
+++ log/check-generated 2021-06-03 06:11:07.256878600 +0100
@@ -1,7 +0,0 @@
-HTTP/1.0 200 OK[CR][LF]
-Content-type: text/html[CR][LF]
-[CR][LF]
-FINE[LF]
-User-Agent: curl-test-suite[CR][LF]
-Accept: */*[CR][LF]
-[CR][LF]
== Contents of files in the log/ dir after test 320
=== Start of file check-expected
HTTP/1.0 200 OK[CR][LF]
Content-type: text/html[CR][LF]
[CR][LF]
FINE[LF]
User-Agent: curl-test-suite[CR][LF]
Accept: */*[CR][LF]
[CR][LF]
=== End of file check-expected
=== Start of file commands.log
../src/curl.exe --output log/curl320.out --include --trace-ascii log/trace320 --trace-time --insecure --tlsauthtype SRP --tlsuser jsmith --tlspassword abc -A curl-test-suite https://127.0.0.1:24569 >log/stdout320 2>log/stderr320
=== End of file commands.log
=== Start of file ftpserver.cmd
Testnum 320
=== End of file ftpserver.cmd
=== Start of file httptls_server.log
Warning: no private key and certificate pairs were set.
HTTP Server listening on IPv6 :: port 24569...done
HTTP Server listening on IPv4 0.0.0.0 port 24569...done
=== End of file httptls_server.log
=== Start of file stderr320
% Total % Received % Xferd Average Speed Time Time Time Current
Dload Upload Total Spent Left Speed

0 0 0 0 0 0 0 0 --:--:-- --:--:-- --:--:-- 0
0 0 0 0 0 0 0 0 --:--:-- --:--:-- --:--:-- 0
curl: (35) OpenSSL SSL_connect: Connection was reset in connection to 127.0.0.1:24569
=== End of file stderr320
=== Start of file trace320
06:11:07.109829 == Info: STATE: INIT => CONNECT handle 0x1868c88; line 1756 (connection #-5000)
06:11:07.112778 == Info: Added connection 0. The cache now contains 1 members
06:11:07.112807 == Info: family0 == v4, family1 == v6
06:11:07.113417 == Info: Trying 127.0.0.1:24569...
06:11:07.114060 == Info: STATE: CONNECT => CONNECTING handle 0x1868c88; line 1817 (connection #0)
06:11:07.114732 == Info: Connected to 127.0.0.1 (127.0.0.1) port 24569 (#0)
06:11:07.114740 == Info: STATE: CONNECTING => PROTOCONNECT handle 0x1868c88; line 1951 (connection #0)
06:11:07.118122 == Info: ALPN, offering http/1.1
06:11:07.118131 == Info: Using TLS-SRP username: jsmith
06:11:07.118137 == Info: Setting cipher list SRP
06:11:07.118714 => Send SSL data, 5 bytes (0x5)
0000: .....
06:11:07.119015 == Info: TLSv1.3 (OUT), TLS handshake, Client hello (1):
06:11:07.119023 => Send SSL data, 512 bytes (0x200)
0000: .............d......)|.$[....I..S.eF.. ..C(....];.....#..1!..v..
0040: .n,/..P.........".!. .................jsmith....................
0080: ....3t.........http/1.1.........1.....0.........................
00c0: ........................+............-.....3.&.$... 6.a.....t..A
0100: N..3A..........A.a.B............................................
0140: ................................................................
0180: ................................................................
01c0: ................................................................
06:11:07.119226 == Info: STATE: PROTOCONNECT => PROTOCONNECTING handle 0x1868c88; line 1967 (connection #0)
06:11:07.121070 == Info: OpenSSL SSL_connect: Connection was reset in connection to 127.0.0.1:24569
06:11:07.121079 == Info: multi_done
06:11:07.121159 == Info: The cache now contains 0 members
06:11:07.121164 == Info: Closing connection 0
06:11:07.121313 == Info: Expire cleared (transfer 0x1868c88)
=== End of file trace320
test 0321...[TLS-SRP with bad username and password]
../src/curl.exe --output log/curl321.out --include --trace-ascii log/trace321 --trace-time --insecure --tlsauthtype SRP --tlsuser baduser --tlspassword badpass https://127.0.0.1:24569 >log/stdout321 2>log/stderr321
CMD (1792): ../src/curl.exe --output log/curl321.out --include --trace-ascii log/trace321 --trace-time --insecure --tlsauthtype SRP --tlsuser baduser --tlspassword badpass https://127.0.0.1:24569 >log/stdout321 2>log/stderr321

curl returned 7, when expecting 35
goto problem 4
exit FAILED
== Contents of files in the log/ dir after test 321
=== Start of file commands.log
../src/curl.exe --output log/curl321.out --include --trace-ascii log/trace321 --trace-time --insecure --tlsauthtype SRP --tlsuser baduser --tlspassword badpass https://127.0.0.1:24569 >log/stdout321 2>log/stderr321
=== End of file commands.log
=== Start of file ftpserver.cmd
Testnum 321
=== End of file ftpserver.cmd
=== Start of file stderr321
% Total % Received % Xferd Average Speed Time Time Time Current
Dload Upload Total Spent Left Speed

0 0 0 0 0 0 0 0 --:--:-- --:--:-- --:--:-- 0
0 0 0 0 0 0 0 0 --:--:-- 0:00:01 --:--:-- 0
curl: (7) Failed to connect to 127.0.0.1 port 24569: Connection refused
=== End of file stderr321
=== Start of file trace321
06:11:07.502898 == Info: STATE: INIT => CONNECT handle 0x13d8be8; line 1756 (connection #-5000)
06:11:07.505519 == Info: Added connection 0. The cache now contains 1 members
06:11:07.505544 == Info: family0 == v4, family1 == v6
06:11:07.506006 == Info: Trying 127.0.0.1:24569...
06:11:07.506340 == Info: STATE: CONNECT => CONNECTING handle 0x13d8be8; line 1817 (connection #0)
06:11:08.506935 == Info: connect to 127.0.0.1 port 24569 failed: Connection refused
06:11:08.506991 == Info: Failed to connect to 127.0.0.1 port 24569: Connection refused
06:11:08.506996 == Info: multi_done
06:11:08.507124 == Info: The cache now contains 0 members
06:11:08.507130 == Info: Closing connection 0
=== End of file trace321
test 0322...[TLS-SRP with bad password]
../src/curl.exe --output log/curl322.out --include --trace-ascii log/trace322 --trace-time --insecure --tlsauthtype SRP --tlsuser jsmith --tlspassword badpass https://127.0.0.1:24569 >log/stdout322 2>log/stderr322
CMD (1792): ../src/curl.exe --output log/curl322.out --include --trace-ascii log/trace322 --trace-time --insecure --tlsauthtype SRP --tlsuser jsmith --tlspassword badpass https://127.0.0.1:24569 >log/stdout322 2>log/stderr322

curl returned 7, when expecting 35
goto problem 5
exit FAILED
== Contents of files in the log/ dir after test 322
=== Start of file commands.log
../src/curl.exe --output log/curl322.out --include --trace-ascii log/trace322 --trace-time --insecure --tlsauthtype SRP --tlsuser jsmith --tlspassword badpass https://127.0.0.1:24569 >log/stdout322 2>log/stderr322
=== End of file commands.log
=== Start of file ftpserver.cmd
Testnum 322
=== End of file ftpserver.cmd
=== Start of file stderr322
% Total % Received % Xferd Average Speed Time Time Time Current
Dload Upload Total Spent Left Speed

0 0 0 0 0 0 0 0 --:--:-- --:--:-- --:--:-- 0
0 0 0 0 0 0 0 0 --:--:-- 0:00:01 --:--:-- 0
curl: (7) Failed to connect to 127.0.0.1 port 24569: Connection refused
=== End of file stderr322
=== Start of file trace322
06:11:08.743053 == Info: STATE: INIT => CONNECT handle 0x17e8be8; line 1756 (connection #-5000)
06:11:08.745820 == Info: Added connection 0. The cache now contains 1 members
06:11:08.745845 == Info: family0 == v4, family1 == v6
06:11:08.746323 == Info: Trying 127.0.0.1:24569...
06:11:08.746714 == Info: STATE: CONNECT => CONNECTING handle 0x17e8be8; line 1817 (connection #0)
06:11:09.748354 == Info: connect to 127.0.0.1 port 24569 failed: Connection refused
06:11:09.748417 == Info: Failed to connect to 127.0.0.1 port 24569: Connection refused
06:11:09.748424 == Info: multi_done
06:11:09.748565 == Info: The cache now contains 0 members
06:11:09.748571 == Info: Closing connection 0
=== End of file trace322
test 0324...[TLS-SRP with server cert checking]
../src/curl.exe --output log/curl324.out --include --trace-ascii log/trace324 --trace-time --tlsauthtype SRP --tlsuser jsmith --tlspassword abc https://127.0.0.1:24569/want/fails >log/stdout324 2>log/stderr324
CMD (1792): ../src/curl.exe --output log/curl324.out --include --trace-ascii log/trace324 --trace-time --tlsauthtype SRP --tlsuser jsmith --tlspassword abc https://127.0.0.1:24569/want/fails >log/stdout324 2>log/stderr324

curl returned 7, when expecting 60
goto problem 6
exit FAILED
== Contents of files in the log/ dir after test 324
=== Start of file commands.log
../src/curl.exe --output log/curl324.out --include --trace-ascii log/trace324 --trace-time --tlsauthtype SRP --tlsuser jsmith --tlspassword abc https://127.0.0.1:24569/want/fails >log/stdout324 2>log/stderr324
=== End of file commands.log
=== Start of file ftpserver.cmd
Testnum 324
=== End of file ftpserver.cmd
=== Start of file stderr324
% Total % Received % Xferd Average Speed Time Time Time Current
Dload Upload Total Spent Left Speed

0 0 0 0 0 0 0 0 --:--:-- --:--:-- --:--:-- 0
0 0 0 0 0 0 0 0 --:--:-- --:--:-- --:--:-- 0
0 0 0 0 0 0 0 0 --:--:-- 0:00:01 --:--:-- 0
curl: (7) Failed to connect to 127.0.0.1 port 24569: Connection refused
=== End of file stderr324
=== Start of file trace324
06:11:10.982009 == Info: STATE: INIT => CONNECT handle 0x1548c08; line 1756 (connection #-5000)
06:11:10.985047 == Info: Added connection 0. The cache now contains 1 members
06:11:10.985075 == Info: family0 == v4, family1 == v6
06:11:10.985578 == Info: Trying 127.0.0.1:24569...
06:11:10.985906 == Info: STATE: CONNECT => CONNECTING handle 0x1548c08; line 1817 (connection #0)
06:11:11.986374 == Info: connect to 127.0.0.1 port 24569 failed: Connection refused
06:11:11.986422 == Info: Failed to connect to 127.0.0.1 port 24569: Connection refused
06:11:11.986427 == Info: multi_done
06:11:11.986538 == Info: The cache now contains 0 members
06:11:11.986543 == Info: Closing connection 0
=== End of file trace324
setenv TZ = GMT
* starts no server
test 0333...[Try a non-boolean command line option with --no-]
../src/curl.exe --output log/curl333.out --include --trace-ascii log/trace333 --trace-time --no-proxy "hey" http://127.0.0.1:47/333 >log/stdout333 2>log/stderr333
CMD (512): ../src/curl.exe --output log/curl333.out --include --trace-ascii log/trace333 --trace-time --no-proxy "hey" http://127.0.0.1:47/333 >log/stdout333 2>log/stderr333
-------e--- OK (332 out of 1415, remaining: 01:42, took 0.216s, duration: 00:31)
test 0355 SKIPPED: curl lacks alt-svc support
setenv CURL_ALTSVC_HTTP = "yeah"
test 0356 SKIPPED: curl lacks alt-svc support
setenv CURL_ALTSVC_HTTP = "yeah"
test 0358 SKIPPED: curl lacks alt-svc support
setenv CURL_ALTSVC_HTTP = "yeah"
setenv CURL_SMALLREQSEND = 48
setenv CURL_SMALLSENDS = 40
test 0400 SKIPPED: curl lacks ftps server support
test 0401 SKIPPED: curl lacks ftps server support
test 0403 SKIPPED: curl lacks ftps server support
setenv XDG_CONFIG_HOME = C:/JA/workspace/_Lib_Tests/cURL_WindowsMaster_Tests_tvcorp/build-1916/tests//log
* starts no server
test 0501...[simple libcurl attempt operation without URL set]
./libtest/lib501.exe http://127.0.0.1:47/501 >log/stdout501 2>log/stderr501
CMD (768): ./libtest/lib501.exe http://127.0.0.1:47/501 >log/stdout501 2>log/stderr501
-------e--- OK (390 out of 1415, remaining: 01:26, took 0.545s, duration: 00:32)
setenv TZ = GMT
test 0506 SKIPPED: curl has threaded-resolver support
* starts no server
test 0509...[initialization with memory callbacks and actual usage]
./libtest/lib509.exe nothing >log/stdout509 2>log/stderr509
CMD (0): ./libtest/lib509.exe nothing >log/stdout509 2>log/stderr509
s------e--- OK (398 out of 1415, remaining: 01:25, took 0.413s, duration: 00:33)
* starts no server
test 0517...[curl_getdate() testing]
./libtest/lib517.exe nothing >log/stdout517 2>log/stderr517
CMD (0): ./libtest/lib517.exe nothing >log/stdout517 2>log/stderr517
-------e--- OK (406 out of 1415, remaining: 01:24, took 0.360s, duration: 00:34)
test 0518 SKIPPED: curl lacks getrlimit support
test 0537 SKIPPED: curl lacks getrlimit support
* starts no server
test 0543...[curl_easy_escape]
./libtest/lib543.exe - >log/stdout543 2>log/stderr543
CMD (0): ./libtest/lib543.exe - >log/stdout543 2>log/stderr543
s------e--- OK (430 out of 1415, remaining: 01:19, took 0.402s, duration: 00:34)
setenv CURL_GETHOSTNAME = curlhost
setenv CURL_GETHOSTNAME = curlhost
setenv CURL_GETHOSTNAME = curlhost
* starts no server
test 0557...[curl_mprintf() testing]
./libtest/lib557.exe nothing >log/stdout557 2>log/stderr557
CMD (0): ./libtest/lib557.exe nothing >log/stdout557 2>log/stderr557
s------e--- OK (444 out of 1415, remaining: 01:18, took 0.431s, duration: 00:35)
test 0558 SKIPPED: curl lacks TrackMemory support
setenv ftp_proxy = http://127.0.0.1:0/
test 0567 SKIPPED: curl lacks rtsp server support
test 0568 SKIPPED: curl lacks rtsp server support
test 0569 SKIPPED: curl lacks rtsp server support
test 0582 SKIPPED: curl lacks sftp server support
test 0583 SKIPPED: curl lacks sftp server support
setenv CURL_GETHOSTNAME = curlhost
test 0600 SKIPPED: curl lacks sftp server support
test 0601 SKIPPED: curl lacks scp server support
test 0603 SKIPPED: curl lacks scp server support
test 0605 SKIPPED: curl lacks scp server support
test 0632 SKIPPED: curl lacks sftp support
test 0646 SKIPPED: curl lacks smtp server support
test 0647 SKIPPED: curl lacks imap server support
test 0648 SKIPPED: curl lacks smtp server support
test 0649 SKIPPED: curl lacks smtp server support
test 0660 SKIPPED: curl lacks imap server support
setenv all_proxy = socks4://127.0.0.1:[not running]
setenv http_proxy = socks5://127.0.0.1:[not running]
setenv all_proxy = socks5://127.0.0.1:[not running]
test 0800 SKIPPED: curl lacks imap server support
setenv CURL_GETHOSTNAME = curlhost
setenv CURL_GETHOSTNAME = curlhost
setenv CURL_GETHOSTNAME = curlhost
setenv CURL_GETHOSTNAME = curlhost
test 0850 SKIPPED: curl lacks pop3 server support
test 0851 SKIPPED: curl lacks pop3 server support
test 0852 SKIPPED: curl lacks pop3 server support
setenv CURL_GETHOSTNAME = curlhost
setenv CURL_GETHOSTNAME = curlhost
setenv CURL_GETHOSTNAME = curlhost
setenv CURL_GETHOSTNAME = curlhost
setenv CURL_GETHOSTNAME = curlhost
setenv CURL_GETHOSTNAME = curlhost
setenv CURL_GETHOSTNAME = curlhost
setenv CURL_GETHOSTNAME = curlhost
setenv LC_ALL = en_US.UTF-8
setenv LC_CTYPE = en_US.UTF-8
test 0955 SKIPPED: curl has win32 support
setenv LC_ALL = en_US.UTF-8
setenv LC_CTYPE = en_US.UTF-8
test 0956 SKIPPED: curl has win32 support
setenv LC_ALL = en_US.UTF-8
setenv LC_CTYPE = en_US.UTF-8
test 0957 SKIPPED: curl has win32 support
setenv LC_ALL = en_US.UTF-8
setenv LC_CTYPE = en_US.UTF-8
setenv LC_ALL = en_US.UTF-8
setenv LC_CTYPE = en_US.UTF-8
setenv LC_ALL = en_US.UTF-8
setenv LC_CTYPE = en_US.UTF-8
setenv LC_ALL = en_US.UTF-8
setenv LC_CTYPE = en_US.UTF-8
setenv LC_ALL = en_US.UTF-8
setenv LC_CTYPE = en_US.UTF-8
test 0962 SKIPPED: curl lacks idn support
setenv LC_ALL = en_US.UTF-8
setenv LC_CTYPE = en_US.UTF-8
test 0963 SKIPPED: curl lacks idn support
setenv LC_ALL = en_US.UTF-8
setenv LC_CTYPE = en_US.UTF-8
setenv LC_ALL = en_US.UTF-8
setenv LC_CTYPE = en_US.UTF-8
setenv LC_ALL = en_US.UTF-8
setenv LC_CTYPE = en_US.UTF-8
setenv LC_ALL = en_US.UTF-8
setenv LC_CTYPE = en_US.UTF-8
setenv LC_ALL = en_US.UTF-8
setenv LC_CTYPE = en_US.UTF-8
setenv CURL_TIME = 13
setenv CURL_DEBUG_SIZE = 4019
setenv CURL_VERSION = curl-unit-test-fake-version
* starts no server
test 0971...[Verify that options-in-versions and docs/cmdline-opts are in sync]
perl -I/curl-7.77.1-20210603/tests /curl-7.77.1-20210603/tests/options-scan.pl /curl-7.77.1-20210603/tests/../docs/options-in-versions /curl-7.77.1-20210603/tests/../docs/cmdline-opts >log/stdout971 2>log/stderr971
CMD (0): perl -I/curl-7.77.1-20210603/tests /curl-7.77.1-20210603/tests/options-scan.pl /curl-7.77.1-20210603/tests/../docs/options-in-versions /curl-7.77.1-20210603/tests/../docs/cmdline-opts >log/stdout971 2>log/stderr971
-r-----e--- OK (747 out of 1415, remaining: 00:36, took 0.864s, duration: 00:40)
setenv CURL_TIME = 13
setenv CURL_DEBUG_SIZE = 4019
setenv CURL_VERSION = curl-unit-test-fake-version
setenv CURL_GETHOSTNAME = curlhost
* starts no server
test 1013...[Compare curl --version with curl-config --protocols]
../src/curl.exe --output log/curl1013.out --include --trace-ascii log/trace1013 --trace-time --version >log/stdout1013 2>log/stderr1013
CMD (0): ../src/curl.exe --output log/curl1013.out --include --trace-ascii log/trace1013 --trace-time --version >log/stdout1013 2>log/stderr1013
postcheck /curl-7.77.1-20210603/tests/libtest/test1013.pl ../curl-config log/stdout1013 protocols
CMD (0): /curl-7.77.1-20210603/tests/libtest/test1013.pl ../curl-config log/stdout1013 protocols
-------e--- OK (762 out of 1415, remaining: 00:35, took 0.364s, duration: 00:41)
* starts no server
test 1014...[Compare curl --version with curl-config --features]
../src/curl.exe --output log/curl1014.out --include --trace-ascii log/trace1014 --trace-time --version >log/stdout1014 2>log/stderr1014
CMD (0): ../src/curl.exe --output log/curl1014.out --include --trace-ascii log/trace1014 --trace-time --version >log/stdout1014 2>log/stderr1014
postcheck /curl-7.77.1-20210603/tests/libtest/test1013.pl ../curl-config log/stdout1014 features
CMD (0): /curl-7.77.1-20210603/tests/libtest/test1013.pl ../curl-config log/stdout1014 features
-------e--- OK (763 out of 1415, remaining: 00:35, took 0.354s, duration: 00:42)
test 1016 SKIPPED: curl lacks file support
test 1017 SKIPPED: curl lacks file support
setenv CURL_GETHOSTNAME = curlhost
* starts no server
test 1022...[Compare curl --version with curl-config --version]
../src/curl.exe --output log/curl1022.out --include --trace-ascii log/trace1022 --trace-time --version >log/stdout1022 2>log/stderr1022
CMD (0): ../src/curl.exe --output log/curl1022.out --include --trace-ascii log/trace1022 --trace-time --version >log/stdout1022 2>log/stderr1022
postcheck /curl-7.77.1-20210603/tests/libtest/test1022.pl ../curl-config log/stdout1022 version
CMD (0): /curl-7.77.1-20210603/tests/libtest/test1022.pl ../curl-config log/stdout1022 version
-------e--- OK (771 out of 1415, remaining: 00:35, took 0.396s, duration: 00:42)
* starts no server
test 1023...[Compare curl --version with curl-config --vernum]
../src/curl.exe --output log/curl1023.out --include --trace-ascii log/trace1023 --trace-time --version >log/stdout1023 2>log/stderr1023
CMD (0): ../src/curl.exe --output log/curl1023.out --include --trace-ascii log/trace1023 --trace-time --version >log/stdout1023 2>log/stderr1023
postcheck /curl-7.77.1-20210603/tests/libtest/test1022.pl ../curl-config log/stdout1023 vernum
CMD (0): /curl-7.77.1-20210603/tests/libtest/test1022.pl ../curl-config log/stdout1023 vernum
-------e--- OK (772 out of 1415, remaining: 00:36, took 0.639s, duration: 00:43)
test 1026 SKIPPED: curl lacks manual support
* starts no server
test 1027...[curl --help]
../src/curl.exe --output log/curl1027.out --include --trace-ascii log/trace1027 --trace-time --help >log/stdout1027 2>log/stderr1027
CMD (0): ../src/curl.exe --output log/curl1027.out --include --trace-ascii log/trace1027 --trace-time --help >log/stdout1027 2>log/stderr1027
postcheck perl -e 'open(IN,$ARGV[0]); my $lines=grep(/(Usage: curl )|(--version\s*Show version)/, <IN>); exit ($lines != 2); # Let this file pass an XML syntax check: </IN>' log/stdout1027
CMD (0): perl -e 'open(IN,$ARGV[0]); my $lines=grep(/(Usage: curl )|(--version\s*Show version)/, <IN>); exit ($lines != 2); # Let this file pass an XML syntax check: </IN>' log/stdout1027
-------e--- OK (776 out of 1415, remaining: 00:35, took 0.344s, duration: 00:43)
setenv LC_CTYPE = en_US.UTF-8
setenv LC_CTYPE = en_US.UTF-8
* starts no server
test 1084...[HTTP GET with invalid --interface]
../src/curl.exe --output log/curl1084.out --include --trace-ascii log/trace1084 --trace-time http://127.0.0.1:47/1084 --interface non-existing-host.haxx.se. >log/stdout1084 2>log/stderr1084
CMD (11520): ../src/curl.exe --output log/curl1084.out --include --trace-ascii log/trace1084 --trace-time http://127.0.0.1:47/1084 --interface non-existing-host.haxx.se. >log/stdout1084 2>log/stderr1084
-------e--- OK (832 out of 1415, remaining: 00:31, took 0.230s, duration: 00:44)
* starts no server
prechecked ./server/resolve --ipv6 ::1
test 1085...[HTTP-IPv6 GET with invalid --interface]
../src/curl.exe --output log/curl1085.out --include --trace-ascii log/trace1085 --trace-time -g "http://[::1]:47/1085" --interface non-existing-host.haxx.se. >log/stdout1085 2>log/stderr1085
CMD (11520): ../src/curl.exe --output log/curl1085.out --include --trace-ascii log/trace1085 --trace-time -g "http://[::1]:47/1085" --interface non-existing-host.haxx.se. >log/stdout1085 2>log/stderr1085
-------e--- OK (833 out of 1415, remaining: 00:31, took 0.431s, duration: 00:45)
setenv CURL_GETHOSTNAME = curlhost
setenv no_proxy = 127.0.0.1
setenv http_proxy = http://non-existing-host.haxx.se:3128/
setenv ftp_proxy = http://127.0.0.1:0/
* starts no server
test 1119...[Verify that symbols-in-versions and headers are in sync]
perl -I/curl-7.77.1-20210603/tests /curl-7.77.1-20210603/tests/symbol-scan.pl /curl-7.77.1-20210603/tests/.. ../include/curl >log/stdout1119 2>log/stderr1119
CMD (0): perl -I/curl-7.77.1-20210603/tests /curl-7.77.1-20210603/tests/symbol-scan.pl /curl-7.77.1-20210603/tests/.. ../include/curl >log/stdout1119 2>log/stderr1119
s------e--- OK (867 out of 1415, remaining: 00:29, took 1.247s, duration: 00:47)
* starts no server
test 1132...[Verify memory #include files in libcurl's C source files]
perl -I/curl-7.77.1-20210603/tests /curl-7.77.1-20210603/tests/mem-include-scan.pl /curl-7.77.1-20210603/tests/../lib >log/stdout1132 2>log/stderr1132
CMD (0): perl -I/curl-7.77.1-20210603/tests /curl-7.77.1-20210603/tests/mem-include-scan.pl /curl-7.77.1-20210603/tests/../lib >log/stdout1132 2>log/stderr1132
-------e--- OK (880 out of 1415, remaining: 00:29, took 0.556s, duration: 00:47)
* starts no server
test 1135...[Verify CURL_EXTERN order]
perl -I/curl-7.77.1-20210603/tests /curl-7.77.1-20210603/tests/extern-scan.pl /curl-7.77.1-20210603/tests/.. >log/stdout1135 2>log/stderr1135
CMD (0): perl -I/curl-7.77.1-20210603/tests /curl-7.77.1-20210603/tests/extern-scan.pl /curl-7.77.1-20210603/tests/.. >log/stdout1135 2>log/stderr1135
s------e--- OK (883 out of 1415, remaining: 00:28, took 0.182s, duration: 00:48)
setenv TZ = GMT
test 1136 SKIPPED: curl lacks PSL support
* starts no server
test 1139...[Verify that all libcurl options have man pages]
perl -I/curl-7.77.1-20210603/tests /curl-7.77.1-20210603/tests/manpage-scan.pl /curl-7.77.1-20210603/tests/.. C:/JA/workspace/_Lib_Tests/cURL_WindowsMaster_Tests_tvcorp/build-1916/tests//.. >log/stdout1139 2>log/stderr1139
CMD (0): perl -I/curl-7.77.1-20210603/tests /curl-7.77.1-20210603/tests/manpage-scan.pl /curl-7.77.1-20210603/tests/.. C:/JA/workspace/_Lib_Tests/cURL_WindowsMaster_Tests_tvcorp/build-1916/tests//.. >log/stdout1139 2>log/stderr1139
-r-----e--- OK (887 out of 1415, remaining: 00:29, took 0.779s, duration: 00:48)
* starts no server
test 1140...[Verify the nroff of man pages]
perl -I/curl-7.77.1-20210603/tests /curl-7.77.1-20210603/tests/nroff-scan.pl /curl-7.77.1-20210603/tests/../docs/ /curl-7.77.1-20210603/tests/../docs/libcurl/*.3 /curl-7.77.1-20210603/tests/../docs/libcurl/opts/*.3 /curl-7.77.1-20210603/tests/../docs/*.1 >log/stdout1140 2>log/stderr1140
CMD (0): perl -I/curl-7.77.1-20210603/tests /curl-7.77.1-20210603/tests/nroff-scan.pl /curl-7.77.1-20210603/tests/../docs/ /curl-7.77.1-20210603/tests/../docs/libcurl/*.3 /curl-7.77.1-20210603/tests/../docs/libcurl/opts/*.3 /curl-7.77.1-20210603/tests/../docs/*.1 >log/stdout1140 2>log/stderr1140
s------e--- OK (888 out of 1415, remaining: 00:29, took 1.245s, duration: 00:50)
setenv MSYS2_ARG_CONV_EXCL = http:/
setenv LC_NUMERIC = en_US.UTF-8
setenv MSYS2_ARG_CONV_EXCL = ftp://
* starts no server
test 1165...[Verify configure.ac and source code CURL_DISABLE_-sync]
perl -I/curl-7.77.1-20210603/tests /curl-7.77.1-20210603/tests/disable-scan.pl /curl-7.77.1-20210603/tests/.. >log/stdout1165 2>log/stderr1165
CMD (0): perl -I/curl-7.77.1-20210603/tests /curl-7.77.1-20210603/tests/disable-scan.pl /curl-7.77.1-20210603/tests/.. >log/stdout1165 2>log/stderr1165
-------e--- OK (913 out of 1415, remaining: 00:28, took 1.008s, duration: 00:51)
* starts no server
test 1167...[Verify curl prefix of public symbols in header files]
perl -I/curl-7.77.1-20210603/tests /curl-7.77.1-20210603/tests/badsymbols.pl /curl-7.77.1-20210603/tests/.. >log/stdout1167 2>log/stderr1167
CMD (0): perl -I/curl-7.77.1-20210603/tests /curl-7.77.1-20210603/tests/badsymbols.pl /curl-7.77.1-20210603/tests/.. >log/stdout1167 2>log/stderr1167
-------e--- OK (915 out of 1415, remaining: 00:30, took 4.922s, duration: 00:56)
* starts no server
sh: /curl-7.77.1-20210603/tests/log/test1196-library.pl: No such file or directory
prechecked /usr/bin/echo 'exit 123' > /curl-7.77.1-20210603/tests/log/test1196-library.pl
test 1169 SKIPPED: precheck command error
* starts no server
test 1173...[Basic man page syntax check]
perl -I/curl-7.77.1-20210603/tests /curl-7.77.1-20210603/tests/manpage-syntax.pl /curl-7.77.1-20210603/tests/../docs/*.1 /curl-7.77.1-20210603/tests/../docs/libcurl/*.3 /curl-7.77.1-20210603/tests/../docs/libcurl/opts/*.3 >log/stdout1173 2>log/stderr1173
CMD (0): perl -I/curl-7.77.1-20210603/tests /curl-7.77.1-20210603/tests/manpage-syntax.pl /curl-7.77.1-20210603/tests/../docs/*.1 /curl-7.77.1-20210603/tests/../docs/libcurl/*.3 /curl-7.77.1-20210603/tests/../docs/libcurl/opts/*.3 >log/stdout1173 2>log/stderr1173
-------e--- OK (921 out of 1415, remaining: 00:30, took 0.621s, duration: 00:57)
* starts no server
test 1175...[Verify that symbols-in-versions and libcurl-errors.3 are in sync]
perl -I/curl-7.77.1-20210603/tests /curl-7.77.1-20210603/tests/error-codes.pl /curl-7.77.1-20210603/tests >log/stdout1175 2>log/stderr1175
CMD (0): perl -I/curl-7.77.1-20210603/tests /curl-7.77.1-20210603/tests/error-codes.pl /curl-7.77.1-20210603/tests >log/stdout1175 2>log/stderr1175
-------e--- OK (923 out of 1415, remaining: 00:30, took 0.173s, duration: 00:57)
* starts no server
test 1177...[Verify that CURL_VERSION_* in headers and docs are in sync]
perl -I/curl-7.77.1-20210603/tests /curl-7.77.1-20210603/tests/version-scan.pl /curl-7.77.1-20210603/tests/../docs/libcurl/curl_version_info.3 /curl-7.77.1-20210603/tests/../include/curl/curl.h >log/stdout1177 2>log/stderr1177
CMD (0): perl -I/curl-7.77.1-20210603/tests /curl-7.77.1-20210603/tests/version-scan.pl /curl-7.77.1-20210603/tests/../docs/libcurl/curl_version_info.3 /curl-7.77.1-20210603/tests/../include/curl/curl.h >log/stdout1177 2>log/stderr1177
-------e--- OK (925 out of 1415, remaining: 00:30, took 0.168s, duration: 00:57)
test 1179 SKIPPED: curl lacks manual support
startnew: server/mqttd.exe --port 0 --pidfile .mqtt_server.pid --portfile .mqtt_server.port --config log/ftpserver.cmd
RUN: MQTT server is now running PID 70328 on PORT 55678
* pid mqtt => 70328 33738
test 1190...[MQTT SUBSCRIBE]
../src/curl.exe --output log/curl1190.out --include --trace log/trace1190 --trace-time mqtt://127.0.0.1:55678/1190 >log/stdout1190 2>log/stderr1190
CMD (0): ../src/curl.exe --output log/curl1190.out --include --trace log/trace1190 --trace-time mqtt://127.0.0.1:55678/1190 >log/stdout1190 2>log/stderr1190
--p----e--- OK (932 out of 1415, remaining: 00:30, took 1.617s, duration: 00:59)
test 1191...[MQTT PUBLISH]
../src/curl.exe --output log/curl1191.out --include --trace log/trace1191 --trace-time mqtt://127.0.0.1:55678/1191 -d something >log/stdout1191 2>log/stderr1191
CMD (0): ../src/curl.exe --output log/curl1191.out --include --trace log/trace1191 --trace-time mqtt://127.0.0.1:55678/1191 -d something >log/stdout1191 2>log/stderr1191
--p----e--- OK (933 out of 1415, remaining: 00:30, took 0.264s, duration: 00:59)
test 1192...[MQTT SUBSCRIBE 2k topic]
../src/curl.exe --output log/curl1192.out --include --trace log/trace1192 --trace-time mqtt://127.0.0.1:55678/AAAAAAAAAAAAAAAAAAAAAAAAAAAAAAAAAAAAAAAAAAAAAAAAAAAAAAAAAAAAAAAAAAAAAAAAAAAAAAAAAAAAAAAAAAAAAAAAAAAAAAAAAAAAAAAAAAAAAAAAAAAAAAAAAAAAAAAAAAAAAAAAAAAAAAAAAAAAAAAAAAAAAAAAAAAAAAAAAAAAAAAAAAAAAAAAAAAAAAAAAAAAAAAAAAAAAAAAAAAAAAAAAAAAAAAAAAAAAAAAAAAAAAAAAAAAAAAAAAAAAAAAAAAAAAAAAAAAAAAAAAAAAAAAAAAAAAAAAAAAAAAAAAAAAAAAAAAAAAAAAAAAAAAAAAAAAAAAAAAAAAAAAAAAAAAAAAAAAAAAAAAAAAAAAAAAAAAAAAAAAAAAAAAAAAAAAAAAAAAAAAAAAAAAAAAAAAAAAAAAAAAAAAAAAAAAAAAAAAAAAAAAAAAAAAAAAAAAAAAAAAAAAAAAAAAAAAAAAAAAAAAAAAAAAAAAAAAAAAAAAAAAAAAAAAAAAAAAAAAAAAAAAAAAAAAAAAAAAAAAAAAAAAAAAAAAAAAAAAAAAAAAAAAAAAAAAAAAAAAAAAAAAAAAAAAAAAAAAAAAAAAAAAAAAAAAAAAAAAAAAAAAAAAAAAAAAAAAAAAAAAAAAAAAAAAAAAAAAAAAAAAAAAAAAAAAAAAAAAAAAAAAAAAAAAAAAAAAAAAAAAAAAAAAAAAAAAAAAAAAAAAAAAAAAAAAAAAAAAAAAAAAAAAAAAAAAAAAAAAAAAAAAAAAAAAAAAAAAAAAAAAAAAAAAAAAAAAAAAAAAAAAAAAAAAAAAAAAAAAAAAAAAAAAAAAAAAAAAAAAAAAAAAAAAAAAAAAAAAAAAAAAAAAAAAAAAAAAAAAAAAAAAAAAAAAAAAAAAAAAAAAAAAAAAAAAAAAAAAAAAAAAAAAAAAAAAAAAAAAAAAAAAAAAAAAAAAAAAAAAAAAAAAAAAAAAAAAAAAAAAAAAAAAAAAAAAAAAAAAAAAAAAAAAAAAAAAAAAAAAAAAAAAAAAAAAAAAAAAAAAAAAAAAAAAAAAAAAAAAAAAAAAAAAAAAAAAAAAAAAAAAAAAAAAAAAAAAAAAAAAAAAAAAAAAAAAAAAAAAAAAAAAAAAAAAAAAAAAAAAAAAAAAAAAAAAAAAAAAAAAAAAAAAAAAAAAAAAAAAAAAAAAAAAAAAAAAAAAAAAAAAAAAAAAAAAAAAAAAAAAAAAAAAAAAAAAAAAAAAAAAAAAAAAAAAAAAAAAAAAAAAAAAAAAAAAAAAAAAAAAAAAAAAAAAAAAAAAAAAAAAAAAAAAAAAAAAAAAAAAAAAAAAAAAAAAAAAAAAAAAAAAAAAAAAAAAAAAAAAAAAAAAAAAAAAAAAAAAAAAAAAAAAAAAAAAAAAAAAAAAAAAAAAAAAAAAAAAAAAAAAAAAAAAAAAAAAAAAAAAAAAAAAAAAAAAAAAAAAAAAAAAAAAAAAAAAAAAAAAAAAAAAAAAAAAAAAAAAAAAAAAAAAAAAAAAAAAAAAAAAAAAAAAAAAAAAAAAAAAAAAAAAAAAAAAAAAAAAAAAAAAAAAAAAAAAAAAAAAAAAAAAAAAAAAAAAAAAAAAAAAAAAAAAAAAAAAAAAAAAAAAAAAAAAAAAAAAAAAAAAAAAAAAAAAAAAAAAAAAAAAAAAAAAAAAAAAAAAAAAAAAAAAAAAAAAAAAAAAAAAAAAAAAAAAAAAAAAAAAAAAAAAAAAAAAAAAAAAAAAAAAAAAAAAAAAAAAAAAAAAAAAAAAAAAAAAAAAAAAAAAAAAAAAAAAAAAAAAAAAAAAAAAAAAAAAAAAAAAAAAAAAAAAAAAAAAAAAAAAAAAAAAAAAAAAAAAAAAAAAAAAAAAAAAAAAAAAAAAAAAAAAAAAAAAAAAAAAAAAAAAAAAAAAAAAAAAAAAAAAAAAAAAAAAAAAAAAAAAAAAAAAAAAAAAAAAAAAAAAAAAAAAAAAAAAAAAAAAAAAAAAAAAAAAAAAAAAAAAAAAAAAAAAAAAAAAAAAAAAAAAAAAAAAAAAAAAAAAAAAAAAAAAAA/1192 >log/stdout1192 2>log/stderr1192
CMD (0): ../src/curl.exe --output log/curl1192.out --include --trace log/trace1192 --trace-time mqtt://127.0.0.1:55678/AAAAAAAAAAAAAAAAAAAAAAAAAAAAAAAAAAAAAAAAAAAAAAAAAAAAAAAAAAAAAAAAAAAAAAAAAAAAAAAAAAAAAAAAAAAAAAAAAAAAAAAAAAAAAAAAAAAAAAAAAAAAAAAAAAAAAAAAAAAAAAAAAAAAAAAAAAAAAAAAAAAAAAAAAAAAAAAAAAAAAAAAAAAAAAAAAAAAAAAAAAAAAAAAAAAAAAAAAAAAAAAAAAAAAAAAAAAAAAAAAAAAAAAAAAAAAAAAAAAAAAAAAAAAAAAAAAAAAAAAAAAAAAAAAAAAAAAAAAAAAAAAAAAAAAAAAAAAAAAAAAAAAAAAAAAAAAAAAAAAAAAAAAAAAAAAAAAAAAAAAAAAAAAAAAAAAAAAAAAAAAAAAAAAAAAAAAAAAAAAAAAAAAAAAAAAAAAAAAAAAAAAAAAAAAAAAAAAAAAAAAAAAAAAAAAAAAAAAAAAAAAAAAAAAAAAAAAAAAAAAAAAAAAAAAAAAAAAAAAAAAAAAAAAAAAAAAAAAAAAAAAAAAAAAAAAAAAAAAAAAAAAAAAAAAAAAAAAAAAAAAAAAAAAAAAAAAAAAAAAAAAAAAAAAAAAAAAAAAAAAAAAAAAAAAAAAAAAAAAAAAAAAAAAAAAAAAAAAAAAAAAAAAAAAAAAAAAAAAAAAAAAAAAAAAAAAAAAAAAAAAAAAAAAAAAAAAAAAAAAAAAAAAAAAAAAAAAAAAAAAAAAAAAAAAAAAAAAAAAAAAAAAAAAAAAAAAAAAAAAAAAAAAAAAAAAAAAAAAAAAAAAAAAAAAAAAAAAAAAAAAAAAAAAAAAAAAAAAAAAAAAAAAAAAAAAAAAAAAAAAAAAAAAAAAAAAAAAAAAAAAAAAAAAAAAAAAAAAAAAAAAAAAAAAAAAAAAAAAAAAAAAAAAAAAAAAAAAAAAAAAAAAAAAAAAAAAAAAAAAAAAAAAAAAAAAAAAAAAAAAAAAAAAAAAAAAAAAAAAAAAAAAAAAAAAAAAAAAAAAAAAAAAAAAAAAAAAAAAAAAAAAAAAAAAAAAAAAAAAAAAAAAAAAAAAAAAAAAAAAAAAAAAAAAAAAAAAAAAAAAAAAAAAAAAAAAAAAAAAAAAAAAAAAAAAAAAAAAAAAAAAAAAAAAAAAAAAAAAAAAAAAAAAAAAAAAAAAAAAAAAAAAAAAAAAAAAAAAAAAAAAAAAAAAAAAAAAAAAAAAAAAAAAAAAAAAAAAAAAAAAAAAAAAAAAAAAAAAAAAAAAAAAAAAAAAAAAAAAAAAAAAAAAAAAAAAAAAAAAAAAAAAAAAAAAAAAAAAAAAAAAAAAAAAAAAAAAAAAAAAAAAAAAAAAAAAAAAAAAAAAAAAAAAAAAAAAAAAAAAAAAAAAAAAAAAAAAAAAAAAAAAAAAAAAAAAAAAAAAAAAAAAAAAAAAAAAAAAAAAAAAAAAAAAAAAAAAAAAAAAAAAAAAAAAAAAAAAAAAAAAAAAAAAAAAAAAAAAAAAAAAAAAAAAAAAAAAAAAAAAAAAAAAAAAAAAAAAAAAAAAAAAAAAAAAAAAAAAAAAAAAAAAAAAAAAAAAAAAAAAAAAAAAAAAAAAAAAAAAAAAAAAAAAAAAAAAAAAAAAAAAAAAAAAAAAAAAAAAAAAAAAAAAAAAAAAAAAAAAAAAAAAAAAAAAAAAAAAAAAAAAAAAAAAAAAAAAAAAAAAAAAAAAAAAAAAAAAAAAAAAAAAAAAAAAAAAAAAAAAAAAAAAAAAAAAAAAAAAAAAAAAAAAAAAAAAAAAAAAAAAAAAAAAAAAAAAAAAAAAAAAAAAAAAAAAAAAAAAAAAAAAAAAAAAAAAAAAAAAAAAAAAAAAAAAAAAAAAAAAAAAAAAAAAAAAAAAAAAAAAAAAAAAAAAAAAAAAAAAAAAAAAAAAAAAAAAAAAAAAAAAAAAAAAAAAAAAAAAAAAAAAAAAAAAAAAAAAAAAAAAAAAAAAAAAAAAAAAAAAAAAAAAAAAAAAAAAAAAAAAAAAAAAAAAAAAAAAAAAAAAAAAAAAAAAAAAAAAAAAAAAAAAAAAAAAAAAAAAAAAAAAAAAA/1192 >log/stdout1192 2>log/stderr1192
--p----e--- OK (934 out of 1415, remaining: 00:30, took 0.340s, duration: 01:00)
test 1193...[MQTT PUBLISH 2k payload]
../src/curl.exe --output log/curl1193.out --include --trace log/trace1193 --trace-time mqtt://127.0.0.1:55678/1193 -d @log/payload1193 >log/stdout1193 2>log/stderr1193
CMD (0): ../src/curl.exe --output log/curl1193.out --include --trace log/trace1193 --trace-time mqtt://127.0.0.1:55678/1193 -d @log/payload1193 >log/stdout1193 2>log/stderr1193
--p----e--- OK (935 out of 1415, remaining: 00:31, took 0.278s, duration: 01:00)
test 1194...[MQTT SUBSCRIBE with PUBLISH befoire SUBACK]
../src/curl.exe --output log/curl1194.out --include --trace log/trace1194 --trace-time mqtt://127.0.0.1:55678/1194 >log/stdout1194 2>log/stderr1194
CMD (0): ../src/curl.exe --output log/curl1194.out --include --trace log/trace1194 --trace-time mqtt://127.0.0.1:55678/1194 >log/stdout1194 2>log/stderr1194
--p----e--- OK (936 out of 1415, remaining: 00:31, took 0.317s, duration: 01:00)
test 1195...[MQTT SUBSCRIBE with short PUBLISH]
../src/curl.exe --output log/curl1195.out --include --trace log/trace1195 --trace-time mqtt://127.0.0.1:55678/1195 >log/stdout1195 2>log/stderr1195
CMD (4608): ../src/curl.exe --output log/curl1195.out --include --trace log/trace1195 --trace-time mqtt://127.0.0.1:55678/1195 >log/stdout1195 2>log/stderr1195
--p----e--- OK (937 out of 1415, remaining: 00:31, took 0.348s, duration: 01:01)
test 1196...[MQTT with error in CONNACK]
../src/curl.exe --output log/curl1196.out --include --trace log/trace1196 --trace-time mqtt://127.0.0.1:55678/1196 >log/stdout1196 2>log/stderr1196
CMD (2048): ../src/curl.exe --output log/curl1196.out --include --trace log/trace1196 --trace-time mqtt://127.0.0.1:55678/1196 >log/stdout1196 2>log/stderr1196
--p----e--- OK (938 out of 1415, remaining: 00:31, took 0.254s, duration: 01:01)
test 1198...[MQTT PUBLISH empty payload, single space topic]
../src/curl.exe --output log/curl1198.out --include --trace log/trace1198 --trace-time mqtt://127.0.0.1:55678/%20 -d "" >log/stdout1198 2>log/stderr1198
CMD (0): ../src/curl.exe --output log/curl1198.out --include --trace log/trace1198 --trace-time mqtt://127.0.0.1:55678/%20 -d "" >log/stdout1198 2>log/stderr1198
--p----e--- OK (940 out of 1415, remaining: 00:31, took 0.258s, duration: 01:01)
test 1199...[MQTT PUBLISH empty payload, no topic]
../src/curl.exe --output log/curl1199.out --include --trace log/trace1199 --trace-time mqtt://127.0.0.1:55678 -d "" >log/stdout1199 2>log/stderr1199
CMD (768): ../src/curl.exe --output log/curl1199.out --include --trace log/trace1199 --trace-time mqtt://127.0.0.1:55678 -d "" >log/stdout1199 2>log/stderr1199
--p----e--- OK (941 out of 1415, remaining: 00:31, took 0.258s, duration: 01:02)
test 1200 SKIPPED: curl lacks gopher server support
test 1201 SKIPPED: curl lacks gopher server support
test 1202 SKIPPED: curl lacks gopher server support
test 1203 SKIPPED: curl lacks gopher-ipv6 server support
setenv CURL_TESTDIR = C:/JA/workspace/_Lib_Tests/cURL_WindowsMaster_Tests_tvcorp/build-1916/tests//log
setenv CURL_GETHOSTNAME = curlhost
* starts no server
test 1234...[abusing {}-globbing]
../src/curl.exe --output log/curl1234.out --include --trace-ascii log/trace1234 --trace-time "127.0.0.1:47/1234[0-1]{" "127.0.0.1:47/{}{}{}{" >log/stdout1234 2>log/stderr1234
CMD (768): ../src/curl.exe --output log/curl1234.out --include --trace-ascii log/trace1234 --trace-time "127.0.0.1:47/1234[0-1]{" "127.0.0.1:47/{}{}{}{" >log/stdout1234 2>log/stderr1234
-------e--- OK (972 out of 1415, remaining: 00:28, took 0.208s, duration: 01:02)
* starts no server
test 1236...[[] globbing overflowing the range counter]
../src/curl.exe --output log/curl1236.out --include --trace-ascii log/trace1236 --trace-time "127.0.0.1:47/1234[0-1]{" "127.0.0.1:47/[1-4611686018427387904][1-4611686018427387904]" >log/stdout1236 2>log/stderr1236
CMD (768): ../src/curl.exe --output log/curl1236.out --include --trace-ascii log/trace1236 --trace-time "127.0.0.1:47/1234[0-1]{" "127.0.0.1:47/[1-4611686018427387904][1-4611686018427387904]" >log/stdout1236 2>log/stderr1236
-------e--- OK (974 out of 1415, remaining: 00:28, took 0.232s, duration: 01:03)
setenv NO_PROXY = 127.0.0.1
setenv http_proxy = http://dummy:[not running]/
setenv http_proxy = http://dummy:[not running]/
setenv NO_PROXY = 127.0.0.1
setenv NO_PROXY = example.com
setenv NO_PROXY = example.com
setenv NO_PROXY = example.com
setenv http_proxy = http://127.0.0.1:0
setenv NO_PROXY = example.com
setenv http_proxy = http://127.0.0.1:0
setenv NO_PROXY = example.com
setenv http_proxy = http://127.0.0.1:0
setenv NO_PROXY = example.com
* starts no server
test 1260...[HTTP URL with rubbish after port number]
../src/curl.exe --output log/curl1260.out --include --trace-ascii log/trace1260 --trace-time -g "http://[127.0.0.1]:47:80/we/want/1260" "http://127.0.0.1:47:80/we/want/1260" "http://user@example.com:80@localhost" >log/stdout1260 2>log/stderr1260
CMD (768): ../src/curl.exe --output log/curl1260.out --include --trace-ascii log/trace1260 --trace-time -g "http://[127.0.0.1]:47:80/we/want/1260" "http://127.0.0.1:47:80/we/want/1260" "http://user@example.com:80@localhost" >log/stdout1260 2>log/stderr1260
-------e--- OK (998 out of 1415, remaining: 00:26, took 0.217s, duration: 01:03)
* starts no server
test 1263...[HTTP URL with rubbish after IPv6 bracket]
../src/curl.exe --output log/curl1263.out --include --trace-ascii log/trace1263 --trace-time -g "http://[127.0.0.1]test:47/we/want/1263" "http://[127.0.0.1][127.0.0.1]:47/we/want/1263" "http://user@[::1]@localhost" >log/stdout1263 2>log/stderr1263
CMD (768): ../src/curl.exe --output log/curl1263.out --include --trace-ascii log/trace1263 --trace-time -g "http://[127.0.0.1]test:47/we/want/1263" "http://[127.0.0.1][127.0.0.1]:47/we/want/1263" "http://user@[::1]@localhost" >log/stdout1263 2>log/stderr1263
-------e--- OK (1001 out of 1415, remaining: 00:26, took 0.219s, duration: 01:03)
* starts no server
test 1264...[HTTP URL with space in host name]
../src/curl.exe --output log/curl1264.out --include --trace-ascii log/trace1264 --trace-time -g "http://127.0.0.1 www.example.com/we/want/1264" >log/stdout1264 2>log/stderr1264
CMD (768): ../src/curl.exe --output log/curl1264.out --include --trace-ascii log/trace1264 --trace-time -g "http://127.0.0.1 www.example.com/we/want/1264" >log/stdout1264 2>log/stderr1264
-------e--- OK (1002 out of 1415, remaining: 00:26, took 0.216s, duration: 01:04)
setenv http_proxy = http://127.0.0.1:0
setenv NO_PROXY = ::1
test 1268 SKIPPED: curl lacks unix-sockets support
* starts no server
test 1269...[too large --retry-delay value]
../src/curl.exe --output log/curl1269.out --include --trace-ascii log/trace1269 --trace-time --retry 3 --retry-delay 9223372036854776 http://127.0.0.1:47/1269 >log/stdout1269 2>log/stderr1269
CMD (512): ../src/curl.exe --output log/curl1269.out --include --trace-ascii log/trace1269 --trace-time --retry 3 --retry-delay 9223372036854776 http://127.0.0.1:47/1269 >log/stdout1269 2>log/stderr1269
-------e--- OK (1007 out of 1415, remaining: 00:26, took 0.199s, duration: 01:04)
test 1272 SKIPPED: curl lacks gophers server support
* starts no server
test 1281...[reject non-numerical port number in URL]
../src/curl.exe --output log/curl1281.out --include --trace-ascii log/trace1281 --trace-time http://127.0.0.1:alpha/beta/1281 >log/stdout1281 2>log/stderr1281
CMD (768): ../src/curl.exe --output log/curl1281.out --include --trace-ascii log/trace1281 --trace-time http://127.0.0.1:alpha/beta/1281 >log/stdout1281 2>log/stderr1281
-------e--- OK (1013 out of 1415, remaining: 00:25, took 0.205s, duration: 01:04)
test 1282 SKIPPED: curl lacks GSS-API support
* starts no server
prechecked /usr/bin/perl -e 'for(1 .. 1000) { printf("upload-file=log/upload-this\nurl=htttttp://non-existing-host.haxx.se/upload/1291\n", $_);}' > log/cmd1291;
test 1291...[Attempt to upload 1000 files but fail immediately]
../src/curl.exe --output log/curl1291.out --include --trace-ascii log/trace1291 --trace-time -K log/cmd1291 --fail-early >log/stdout1291 2>log/stderr1291
CMD (256): ../src/curl.exe --output log/curl1291.out --include --trace-ascii log/trace1291 --trace-time -K log/cmd1291 --fail-early >log/stdout1291 2>log/stderr1291
-------e--- OK (1023 out of 1415, remaining: 00:24, took 0.402s, duration: 01:05)
setenv CURL_SMALLREQSEND = 128
setenv CURL_SMALLREQSEND = 100
* starts no server
test 1300...[llist unit tests]
./unit/unit1300 - >log/stdout1300 2>log/stderr1300
CMD (0): ./unit/unit1300 - >log/stdout1300 2>log/stderr1300
-------e--- OK (1032 out of 1415, remaining: 00:24, took 0.255s, duration: 01:05)
* starts no server
test 1301...[curl_strcasecompare unit tests]
./unit/unit1301 - >log/stdout1301 2>log/stderr1301
CMD (0): ./unit/unit1301 - >log/stdout1301 2>log/stderr1301
-------e--- OK (1033 out of 1415, remaining: 00:24, took 0.288s, duration: 01:05)
* starts no server
test 1302...[base64 encode/decode unit tests]
./unit/unit1302 - >log/stdout1302 2>log/stderr1302
CMD (0): ./unit/unit1302 - >log/stdout1302 2>log/stderr1302
-------e--- OK (1034 out of 1415, remaining: 00:24, took 0.288s, duration: 01:06)
* starts no server
test 1303...[Curl_timeleft unit tests]
./unit/unit1303 - >log/stdout1303 2>log/stderr1303
CMD (0): ./unit/unit1303 - >log/stdout1303 2>log/stderr1303
-------e--- OK (1035 out of 1415, remaining: 00:24, took 0.268s, duration: 01:06)
* starts no server
test 1304...[netrc parsing unit tests]
./unit/unit1304 - >log/stdout1304 2>log/stderr1304
CMD (0): ./unit/unit1304 - >log/stdout1304 2>log/stderr1304
-------e--- OK (1036 out of 1415, remaining: 00:24, took 0.262s, duration: 01:06)
* starts no server
test 1305...[internal hash create/destroy testing]
./unit/unit1305 1305 >log/stdout1305 2>log/stderr1305
CMD (0): ./unit/unit1305 1305 >log/stdout1305 2>log/stderr1305
-------e--- OK (1037 out of 1415, remaining: 00:24, took 0.276s, duration: 01:06)
* starts no server
test 1306...[internal hash create/add/destroy testing]
./unit/unit1305.exe 1306 >log/stdout1306 2>log/stderr1306
CMD (0): ./unit/unit1305.exe 1306 >log/stdout1306 2>log/stderr1306
-------e--- OK (1038 out of 1415, remaining: 00:24, took 0.204s, duration: 01:07)
* starts no server
test 1308...[formpost unit tests]
./unit/unit1308 - >log/stdout1308 2>log/stderr1308
CMD (0): ./unit/unit1308 - >log/stdout1308 2>log/stderr1308
-------e--- OK (1039 out of 1415, remaining: 00:24, took 0.269s, duration: 01:07)
* starts no server
test 1309...[splay unit tests]
./unit/unit1309 - >log/stdout1309 2>log/stderr1309
CMD (0): ./unit/unit1309 - >log/stdout1309 2>log/stderr1309
s------e--- OK (1040 out of 1415, remaining: 00:24, took 0.384s, duration: 01:07)
setenv CURL_GETHOSTNAME = curlhost
setenv CURL_NTLM_WB_FILE = C:/JA/workspace/_Lib_Tests/cURL_WindowsMaster_Tests_tvcorp/build-1916/tests//server/fake_ntlm
setenv CURL_NTLM_AUTH_SRCDIR = /curl-7.77.1-20210603/tests
setenv CURL_NTLM_AUTH_TESTNUM = 1310
test 1310 SKIPPED: curl lacks NTLM_WB support
setenv CURL_TESTDIR = C:/JA/workspace/_Lib_Tests/cURL_WindowsMaster_Tests_tvcorp/build-1916/tests//log
setenv CURL_TESTDIR = C:/JA/workspace/_Lib_Tests/cURL_WindowsMaster_Tests_tvcorp/build-1916/tests//log
setenv CURL_TESTDIR = C:/JA/workspace/_Lib_Tests/cURL_WindowsMaster_Tests_tvcorp/build-1916/tests//log
* starts no server
test 1323...[curlx_tvdiff]
./unit/unit1323 - >log/stdout1323 2>log/stderr1323
CMD (0): ./unit/unit1323 - >log/stdout1323 2>log/stderr1323
-------e--- OK (1053 out of 1415, remaining: 00:23, took 0.254s, duration: 01:08)
test 1326 SKIPPED: curl lacks telnet support
test 1327 SKIPPED: curl lacks telnet support
test 1330 SKIPPED: curl lacks TrackMemory support
setenv CURL_TESTDIR = C:/JA/workspace/_Lib_Tests/cURL_WindowsMaster_Tests_tvcorp/build-1916/tests//log
setenv CURL_TESTDIR = C:/JA/workspace/_Lib_Tests/cURL_WindowsMaster_Tests_tvcorp/build-1916/tests//log
setenv CURL_TESTDIR = C:/JA/workspace/_Lib_Tests/cURL_WindowsMaster_Tests_tvcorp/build-1916/tests//log
setenv CURL_TESTDIR = C:/JA/workspace/_Lib_Tests/cURL_WindowsMaster_Tests_tvcorp/build-1916/tests//log
setenv CURL_TESTDIR = C:/JA/workspace/_Lib_Tests/cURL_WindowsMaster_Tests_tvcorp/build-1916/tests//log
setenv CURL_TESTDIR = C:/JA/workspace/_Lib_Tests/cURL_WindowsMaster_Tests_tvcorp/build-1916/tests//log
setenv CURL_TESTDIR = C:/JA/workspace/_Lib_Tests/cURL_WindowsMaster_Tests_tvcorp/build-1916/tests//log
setenv CURL_TESTDIR = C:/JA/workspace/_Lib_Tests/cURL_WindowsMaster_Tests_tvcorp/build-1916/tests//log
setenv CURL_TESTDIR = C:/JA/workspace/_Lib_Tests/cURL_WindowsMaster_Tests_tvcorp/build-1916/tests//log
setenv CURL_TESTDIR = C:/JA/workspace/_Lib_Tests/cURL_WindowsMaster_Tests_tvcorp/build-1916/tests//log
setenv CURL_TESTDIR = C:/JA/workspace/_Lib_Tests/cURL_WindowsMaster_Tests_tvcorp/build-1916/tests//log
setenv CURL_TESTDIR = C:/JA/workspace/_Lib_Tests/cURL_WindowsMaster_Tests_tvcorp/build-1916/tests//log
setenv CURL_TESTDIR = C:/JA/workspace/_Lib_Tests/cURL_WindowsMaster_Tests_tvcorp/build-1916/tests//log
setenv CURL_TESTDIR = C:/JA/workspace/_Lib_Tests/cURL_WindowsMaster_Tests_tvcorp/build-1916/tests//log
setenv CURL_TESTDIR = C:/JA/workspace/_Lib_Tests/cURL_WindowsMaster_Tests_tvcorp/build-1916/tests//log
setenv CURL_TESTDIR = C:/JA/workspace/_Lib_Tests/cURL_WindowsMaster_Tests_tvcorp/build-1916/tests//log
setenv CURL_TESTDIR = C:/JA/workspace/_Lib_Tests/cURL_WindowsMaster_Tests_tvcorp/build-1916/tests//log
setenv CURL_TESTDIR = C:/JA/workspace/_Lib_Tests/cURL_WindowsMaster_Tests_tvcorp/build-1916/tests//log
setenv CURL_TESTDIR = C:/JA/workspace/_Lib_Tests/cURL_WindowsMaster_Tests_tvcorp/build-1916/tests//log
setenv CURL_TESTDIR = C:/JA/workspace/_Lib_Tests/cURL_WindowsMaster_Tests_tvcorp/build-1916/tests//log
setenv CURL_TESTDIR = C:/JA/workspace/_Lib_Tests/cURL_WindowsMaster_Tests_tvcorp/build-1916/tests//log
setenv CURL_TESTDIR = C:/JA/workspace/_Lib_Tests/cURL_WindowsMaster_Tests_tvcorp/build-1916/tests//log
setenv CURL_TESTDIR = C:/JA/workspace/_Lib_Tests/cURL_WindowsMaster_Tests_tvcorp/build-1916/tests//log
setenv CURL_TESTDIR = C:/JA/workspace/_Lib_Tests/cURL_WindowsMaster_Tests_tvcorp/build-1916/tests//log
setenv CURL_TESTDIR = C:/JA/workspace/_Lib_Tests/cURL_WindowsMaster_Tests_tvcorp/build-1916/tests//log
setenv CURL_TESTDIR = C:/JA/workspace/_Lib_Tests/cURL_WindowsMaster_Tests_tvcorp/build-1916/tests//log
setenv CURL_TESTDIR = C:/JA/workspace/_Lib_Tests/cURL_WindowsMaster_Tests_tvcorp/build-1916/tests//log
setenv CURL_TESTDIR = C:/JA/workspace/_Lib_Tests/cURL_WindowsMaster_Tests_tvcorp/build-1916/tests//log
setenv CURL_TESTDIR = C:/JA/workspace/_Lib_Tests/cURL_WindowsMaster_Tests_tvcorp/build-1916/tests//log
setenv CURL_TESTDIR = C:/JA/workspace/_Lib_Tests/cURL_WindowsMaster_Tests_tvcorp/build-1916/tests//log
* starts no server
test 1394...[unit test for parse_cert_parameter()]
./unit/unit1394 - >log/stdout1394 2>log/stderr1394
CMD (0): ./unit/unit1394 - >log/stdout1394 2>log/stderr1394
-------e--- OK (1124 out of 1415, remaining: 00:18, took 0.299s, duration: 01:09)
* starts no server
test 1395...[Curl_dedotdotify]
./unit/unit1395 - >log/stdout1395 2>log/stderr1395
CMD (0): ./unit/unit1395 - >log/stdout1395 2>log/stderr1395
-------e--- OK (1125 out of 1415, remaining: 00:18, took 0.261s, duration: 01:09)
* starts no server
test 1396...[curl_easy_escape and curl_easy_unescape]
./unit/unit1396 - >log/stdout1396 2>log/stderr1396
CMD (0): ./unit/unit1396 - >log/stdout1396 2>log/stderr1396
-------e--- OK (1126 out of 1415, remaining: 00:18, took 0.305s, duration: 01:10)
* starts no server
test 1397...[Check wildcard certificate matching function Curl_cert_hostcheck]
./unit/unit1397 - >log/stdout1397 2>log/stderr1397
CMD (0): ./unit/unit1397 - >log/stdout1397 2>log/stderr1397
-------e--- OK (1127 out of 1415, remaining: 00:18, took 0.277s, duration: 01:10)
* starts no server
test 1398...[curl_msnprintf unit tests]
./unit/unit1398 - >log/stdout1398 2>log/stderr1398
CMD (0): ./unit/unit1398 - >log/stdout1398 2>log/stderr1398
-------e--- OK (1128 out of 1415, remaining: 00:18, took 0.301s, duration: 01:10)
* starts no server
test 1399...[Curl_pgrsTime unit tests]
./unit/unit1399 - >log/stdout1399 2>log/stderr1399
CMD (0): ./unit/unit1399 - >log/stdout1399 2>log/stderr1399
-------e--- OK (1129 out of 1415, remaining: 00:18, took 0.285s, duration: 01:11)
* starts no server
test 1409...[Pass in string to -C]
../src/curl.exe --output log/curl1409.out --include --trace-ascii log/trace1409 --trace-time http://127.0.0.1:47/1409 -C wrong >log/stdout1409 2>log/stderr1409
CMD (512): ../src/curl.exe --output log/curl1409.out --include --trace-ascii log/trace1409 --trace-time http://127.0.0.1:47/1409 -C wrong >log/stdout1409 2>log/stderr1409
-------e--- OK (1139 out of 1415, remaining: 00:17, took 0.206s, duration: 01:11)
* starts no server
test 1410...[Pass in negative number to --max-time]
../src/curl.exe --output log/curl1410.out --include --trace-ascii log/trace1410 --trace-time http://127.0.0.1:47/1410 --max-time -4 >log/stdout1410 2>log/stderr1410
CMD (512): ../src/curl.exe --output log/curl1410.out --include --trace-ascii log/trace1410 --trace-time http://127.0.0.1:47/1410 --max-time -4 >log/stdout1410 2>log/stderr1410
-------e--- OK (1140 out of 1415, remaining: 00:17, took 0.214s, duration: 01:11)
setenv TZ = GMT
setenv CURL_TESTDIR = C:/JA/workspace/_Lib_Tests/cURL_WindowsMaster_Tests_tvcorp/build-1916/tests//log
setenv CURL_ISATTY = yes
setenv CURL_ISATTY = yes
* starts no server
test 1427...[too large -m timeout value]
../src/curl.exe --output log/curl1427.out --include --trace-ascii log/trace1427 --trace-time http://127.0.0.1:47/1427 -m 184467440737095510 >log/stdout1427 2>log/stderr1427
CMD (512): ../src/curl.exe --output log/curl1427.out --include --trace-ascii log/trace1427 --trace-time http://127.0.0.1:47/1427 -m 184467440737095510 >log/stdout1427 2>log/stderr1427
-------e--- OK (1157 out of 1415, remaining: 00:16, took 0.212s, duration: 01:12)
test 1435 SKIPPED: curl lacks unix-sockets support
test 1436 SKIPPED: curl lacks unix-sockets support
setenv CURL_TESTDIR = C:/JA/workspace/_Lib_Tests/cURL_WindowsMaster_Tests_tvcorp/build-1916/tests//log
setenv LC_ALL = en_US.UTF-8
setenv LC_CTYPE = en_US.UTF-8
test 1450 SKIPPED: curl lacks dict support
test 1451 SKIPPED: curl lacks smb support
test 1452 SKIPPED: curl lacks telnet support
test 1453 SKIPPED: curl lacks tftp support
test 1454 SKIPPED: curl has ipv6 support
setenv CURL_HOME = C:/JA/workspace/_Lib_Tests/cURL_WindowsMaster_Tests_tvcorp/build-1916/tests//log/test1459.dir
test 1459 SKIPPED: curl lacks sftp support
setenv CURL_TESTDIR = C:/JA/workspace/_Lib_Tests/cURL_WindowsMaster_Tests_tvcorp/build-1916/tests//log
* starts no server
test 1461...[curl important --help]
../src/curl.exe --include --trace-ascii log/trace1461 --trace-time --help >log/stdout1461 2>log/stderr1461
CMD (0): ../src/curl.exe --include --trace-ascii log/trace1461 --trace-time --help >log/stdout1461 2>log/stderr1461
s------e--- OK (1191 out of 1415, remaining: 00:13, took 0.262s, duration: 01:13)
* starts no server
test 1462...[curl invalid category --help]
../src/curl.exe --include --trace-ascii log/trace1462 --trace-time --help sdfafdsfadsfsd >log/stdout1462 2>log/stderr1462
CMD (0): ../src/curl.exe --include --trace-ascii log/trace1462 --trace-time --help sdfafdsfadsfsd >log/stdout1462 2>log/stderr1462
s------e--- OK (1192 out of 1415, remaining: 00:13, took 0.406s, duration: 01:13)
* starts no server
test 1508...[Close a multi handle without using it]
./libtest/lib1508.exe http://127.0.0.1:47/path/1508 >log/stdout1508 2>log/stderr1508
CMD (0): ./libtest/lib1508.exe http://127.0.0.1:47/path/1508 >log/stdout1508 2>log/stderr1508
------oe--- OK (1204 out of 1415, remaining: 00:12, took 0.321s, duration: 01:13)
* starts no server
test 1521...[Test all curl_easy_setopt and curl_easy_getinfo options]
./libtest/lib1521.exe unused >log/stdout1521 2>log/stderr1521
CMD (0): ./libtest/lib1521.exe unused >log/stdout1521 2>log/stderr1521
-------e--- OK (1215 out of 1415, remaining: 00:12, took 0.285s, duration: 01:14)
* starts no server
test 1530...[CURLOPT_OPENSOCKETFUNCTION returns bad socket]
./libtest/lib1530.exe - >log/stdout1530 2>log/stderr1530
CMD (1792): ./libtest/lib1530.exe - >log/stdout1530 2>log/stderr1530
-------e--- OK (1224 out of 1415, remaining: 00:11, took 0.272s, duration: 01:14)
* starts no server
test 1537...[libcurl URL escape/unescape tests]
./libtest/lib1537.exe nothing >log/stdout1537 2>log/stderr1537
CMD (0): ./libtest/lib1537.exe nothing >log/stdout1537 2>log/stderr1537
s------e--- OK (1231 out of 1415, remaining: 00:11, took 0.291s, duration: 01:15)
* starts no server
test 1538...[libcurl strerror API call tests]
./libtest/lib1538.exe nothing >log/stdout1538 2>log/stderr1538
CMD (0): ./libtest/lib1538.exe nothing >log/stdout1538 2>log/stderr1538
s------e--- OK (1232 out of 1415, remaining: 00:11, took 0.281s, duration: 01:15)
* starts no server
test 1550...[verify setting pipeling blocklisting options]
./libtest/lib1550.exe http://127.0.0.1:47/1550 >log/stdout1550 2>log/stderr1550
CMD (0): ./libtest/lib1550.exe http://127.0.0.1:47/1550 >log/stdout1550 2>log/stderr1550
-------e--- OK (1235 out of 1415, remaining: 00:11, took 0.272s, duration: 01:15)
* starts no server
test 1557...[Removing easy handle that's in the pending connections list doesn't leave behind a dangling entry]
./libtest/lib1557.exe nothing >log/stdout1557 2>log/stderr1557
CMD (0): ./libtest/lib1557.exe nothing >log/stdout1557 2>log/stderr1557
-------e--- OK (1242 out of 1415, remaining: 00:10, took 0.336s, duration: 01:16)
* starts no server
test 1559...[Set excessive URL lengths]
./libtest/lib1559.exe - >log/stdout1559 2>log/stderr1559
CMD (0): ./libtest/lib1559.exe - >log/stdout1559 2>log/stderr1559
s------e--- OK (1244 out of 1415, remaining: 00:10, took 0.325s, duration: 01:16)
* starts no server
test 1564...[wakeup before poll with no easy handles]
./libtest/lib1564.exe - >log/stdout1564 2>log/stderr1564
CMD (0): ./libtest/lib1564.exe - >log/stdout1564 2>log/stderr1564
-------e--- OK (1249 out of 1415, remaining: 00:10, took 3.387s, duration: 01:20)
* starts no server
test 1592...[HTTP request, remove handle while resolving, don't block]
./libtest/lib1592.exe http://a-site-never-accessed.example.org/1592 >log/stdout1592 2>log/stderr1592
CMD (0): ./libtest/lib1592.exe http://a-site-never-accessed.example.org/1592 >log/stdout1592 2>log/stderr1592
-------e--- OK (1258 out of 1415, remaining: 00:10, took 0.345s, duration: 01:20)
* starts no server
test 1601...[MD5 unit tests]
./unit/unit1601 - >log/stdout1601 2>log/stderr1601
CMD (0): ./unit/unit1601 - >log/stdout1601 2>log/stderr1601
-------e--- OK (1264 out of 1415, remaining: 00:09, took 0.283s, duration: 01:21)
* starts no server
test 1602...[Internal hash create/add/destroy testing, exercising clean functions]
./unit/unit1602 - >log/stdout1602 2>log/stderr1602
CMD (0): ./unit/unit1602 - >log/stdout1602 2>log/stderr1602
-------e--- OK (1265 out of 1415, remaining: 00:09, took 0.269s, duration: 01:21)
* starts no server
test 1603...[Internal hash add, retrieval, deletion testing]
./unit/unit1603 - >log/stdout1603 2>log/stderr1603
CMD (0): ./unit/unit1603 - >log/stdout1603 2>log/stderr1603
-------e--- OK (1266 out of 1415, remaining: 00:09, took 0.292s, duration: 01:21)
* starts no server
test 1604...[Test WIN32/MSDOS filename sanitization]
./unit/unit1604 - >log/stdout1604 2>log/stderr1604
CMD (0): ./unit/unit1604 - >log/stdout1604 2>log/stderr1604
-------e--- OK (1267 out of 1415, remaining: 00:09, took 0.336s, duration: 01:22)
* starts no server
test 1605...[Test negative data lengths as input to libcurl functions]
./unit/unit1605 - >log/stdout1605 2>log/stderr1605
CMD (0): ./unit/unit1605 - >log/stdout1605 2>log/stderr1605
-------e--- OK (1268 out of 1415, remaining: 00:09, took 0.286s, duration: 01:22)
* starts no server
test 1606...[verify speedcheck]
./unit/unit1606 - >log/stdout1606 2>log/stderr1606
CMD (0): ./unit/unit1606 - >log/stdout1606 2>log/stderr1606
-------e--- OK (1269 out of 1415, remaining: 00:09, took 0.292s, duration: 01:22)
* starts no server
test 1607...[CURLOPT_RESOLVE parsing]
./unit/unit1607 - >log/stdout1607 2>log/stderr1607
CMD (0): ./unit/unit1607 - >log/stdout1607 2>log/stderr1607
-------e--- OK (1270 out of 1415, remaining: 00:09, took 0.314s, duration: 01:22)
* starts no server
test 1608...[verify DNS shuffling]
./unit/unit1608 - >log/stdout1608 2>log/stderr1608
CMD (0): ./unit/unit1608 - >log/stdout1608 2>log/stderr1608
-------e--- OK (1271 out of 1415, remaining: 00:09, took 0.332s, duration: 01:23)
* starts no server
test 1609...[CURLOPT_RESOLVE parsing]
./unit/unit1609 - >log/stdout1609 2>log/stderr1609
CMD (0): ./unit/unit1609 - >log/stdout1609 2>log/stderr1609
-------e--- OK (1272 out of 1415, remaining: 00:09, took 0.314s, duration: 01:23)
* starts no server
test 1610...[SHA256 unit tests]
./unit/unit1610 - >log/stdout1610 2>log/stderr1610
CMD (0): ./unit/unit1610 - >log/stdout1610 2>log/stderr1610
-------e--- OK (1273 out of 1415, remaining: 00:09, took 0.295s, duration: 01:23)
* starts no server
test 1611...[MD4 unit tests]
./unit/unit1611 - >log/stdout1611 2>log/stderr1611
CMD (0): ./unit/unit1611 - >log/stdout1611 2>log/stderr1611
-------e--- OK (1274 out of 1415, remaining: 00:09, took 0.521s, duration: 01:24)
* starts no server
test 1612...[HMAC unit tests]
./unit/unit1612 - >log/stdout1612 2>log/stderr1612
CMD (0): ./unit/unit1612 - >log/stdout1612 2>log/stderr1612
-------e--- OK (1275 out of 1415, remaining: 00:09, took 0.432s, duration: 01:24)
* starts no server
test 1620...[unit tests for url.c]
./unit/unit1620 - >log/stdout1620 2>log/stderr1620
CMD (0): ./unit/unit1620 - >log/stdout1620 2>log/stderr1620
-------e--- OK (1277 out of 1415, remaining: 00:09, took 0.294s, duration: 01:25)
* starts no server
test 1621...[unit tests for stripcredentials from URL]
./unit/unit1621 - >log/stdout1621 2>log/stderr1621
CMD (0): ./unit/unit1621 - >log/stdout1621 2>log/stderr1621
-------e--- OK (1278 out of 1415, remaining: 00:09, took 0.274s, duration: 01:25)
test 1650 SKIPPED: curl lacks DoH support
* starts no server
test 1651...[x509 parsing]
./unit/unit1651 - >log/stdout1651 2>log/stderr1651
CMD (0): ./unit/unit1651 - >log/stdout1651 2>log/stderr1651
-------e--- OK (1285 out of 1415, remaining: 00:08, took 0.283s, duration: 01:25)
* starts no server
test 1652...[infof]
./unit/unit1652 - >log/stdout1652 2>log/stderr1652
CMD (0): ./unit/unit1652 - >log/stdout1652 2>log/stderr1652
-------e--- OK (1286 out of 1415, remaining: 00:08, took 0.290s, duration: 01:26)
* starts no server
test 1653...[urlapi port number parsing]
./unit/unit1653 - >log/stdout1653 2>log/stderr1653
CMD (0): ./unit/unit1653 - >log/stdout1653 2>log/stderr1653
-------e--- OK (1287 out of 1415, remaining: 00:08, took 0.286s, duration: 01:26)
setenv CURL_TIME = 1548369261
test 1655 SKIPPED: curl lacks DoH support
* starts no server
setenv CURL_TIME = 1548369261
test 1660...[HSTS]
./unit/unit1660 - >log/stdout1660 2>log/stderr1660
CMD (0): ./unit/unit1660 - >log/stdout1660 2>log/stderr1660
s-----oe--- OK (1290 out of 1415, remaining: 00:08, took 0.355s, duration: 01:26)
* starts no server
test 1661...[bufref unit tests]
./unit/unit1661 - >log/stdout1661 2>log/stderr1661
CMD (0): ./unit/unit1661 - >log/stdout1661 2>log/stderr1661
-------e--- OK (1291 out of 1415, remaining: 00:08, took 0.484s, duration: 01:27)
test 1700 SKIPPED: curl lacks http/2 server support
test 1701 SKIPPED: curl lacks http/2 server support
test 1702 SKIPPED: curl lacks http/2 server support
test 1703 SKIPPED: curl lacks Unicode support
test 1800 SKIPPED: curl lacks http/2 support
setenv CURL_ALTSVC_HTTP = "yeah"
* starts no server
test 1911...[verify that curl_easy_setopt() rejects too long string inputs]
./libtest/lib1911.exe - >log/stdout1911 2>log/stderr1911
CMD (0): ./libtest/lib1911.exe - >log/stdout1911 2>log/stderr1911
-------e--- OK (1304 out of 1415, remaining: 00:07, took 0.771s, duration: 01:28)
* starts no server
test 1912...[Cross validate that gcc-typecheck macros match the option types.]
./libtest/lib1912.exe - >log/stdout1912 2>log/stderr1912
CMD (0): ./libtest/lib1912.exe - >log/stdout1912 2>log/stderr1912
-------e--- OK (1305 out of 1415, remaining: 00:07, took 0.296s, duration: 01:28)
* starts no server
test 1915...[HSTS read/write callbacks]
./libtest/lib1915.exe http://127.0.0.1:47/not-there/1915 >log/stdout1915 2>log/stderr1915
CMD (1792): ./libtest/lib1915.exe http://127.0.0.1:47/not-there/1915 >log/stdout1915 2>log/stderr1915
s------e--- OK (1308 out of 1415, remaining: 00:07, took 1.314s, duration: 01:30)
test 1916...[MQTT PUBLISH with no POSTFIELDSIZE set]
./libtest/lib1916.exe "mqtt://127.0.0.1:55678/ " >log/stdout1916 2>log/stderr1916
CMD (0): ./libtest/lib1916.exe "mqtt://127.0.0.1:55678/ " >log/stdout1916 2>log/stderr1916
--p----e--- OK (1309 out of 1415, remaining: 00:07, took 0.409s, duration: 01:30)
test 1917...[MQTT PUBLISH with CURLOPT_POST set (no payload)]
./libtest/lib1917.exe "mqtt://127.0.0.1:55678/ " >log/stdout1917 2>log/stderr1917
CMD (11008): ./libtest/lib1917.exe "mqtt://127.0.0.1:55678/ " >log/stdout1917 2>log/stderr1917
--p----e--- OK (1310 out of 1415, remaining: 00:07, took 0.373s, duration: 01:30)
* starts no server
test 1918...[curl_easy_option_by_name() and curl_easy_option_by_id()]
./libtest/lib1918.exe - >log/stdout1918 2>log/stderr1918
CMD (0): ./libtest/lib1918.exe - >log/stdout1918 2>log/stderr1918
-------e--- OK (1311 out of 1415, remaining: 00:07, took 0.310s, duration: 01:31)
setenv CURL_TESTDIR = C:/JA/workspace/_Lib_Tests/cURL_WindowsMaster_Tests_tvcorp/build-1916/tests//log
setenv CURL_TESTDIR = C:/JA/workspace/_Lib_Tests/cURL_WindowsMaster_Tests_tvcorp/build-1916/tests//log
setenv CURL_GETHOSTNAME = curlhost
setenv CURL_GETHOSTNAME = curlhost
setenv CURL_GETHOSTNAME = curlhost
setenv CURL_GETHOSTNAME = curlhost
setenv CURL_GETHOSTNAME = curlhost
setenv CURL_GETHOSTNAME = curlhost
setenv CURL_GETHOSTNAME = curlhost
setenv CURL_GETHOSTNAME = curlhost
setenv CURL_GETHOSTNAME = curlhost
setenv CURL_GETHOSTNAME = curlhost
* starts no server
test 2036...[HTTP, -O with no slash at all in the URL]
../src/curl.exe --include --trace-ascii log/trace2036 --trace-time 127.0.0.1:47 -O >log/stdout2036 2>log/stderr2036
CMD (5888): ../src/curl.exe --include --trace-ascii log/trace2036 --trace-time 127.0.0.1:47 -O >log/stdout2036 2>log/stderr2036
-------e--- OK (1351 out of 1415, remaining: 00:04, took 0.208s, duration: 01:32)
test 2043 SKIPPED: curl lacks Schannel support
* starts no server
test 2044...[Attempt to set a default protocol that does not exist]
../src/curl.exe --output log/curl2044.out --include --trace-ascii log/trace2044 --trace-time --proto-default DOESNOTEXIST >log/stdout2044 2>log/stderr2044
CMD (256): ../src/curl.exe --output log/curl2044.out --include --trace-ascii log/trace2044 --trace-time --proto-default DOESNOTEXIST >log/stdout2044 2>log/stderr2044
-------e--- OK (1359 out of 1415, remaining: 00:03, took 0.207s, duration: 01:32)
setenv LC_ALL = en_US.UTF-8
setenv LC_CTYPE = en_US.UTF-8
setenv LC_ALL = en_US.UTF-8
setenv LC_CTYPE = en_US.UTF-8
setenv CURL_STUB_GSS_CREDS = "KRB5_Alice"
test 2056 SKIPPED: curl lacks GSS-API support
setenv CURL_STUB_GSS_CREDS = "NTLM_Alice"
test 2057 SKIPPED: curl lacks GSS-API support
setenv CURL_SSL_BACKEND = schannel
test 2070 SKIPPED: curl lacks Schannel support
* starts no server
test 2075...[Verify usernames are not allowed in url]
../src/curl.exe --output log/curl2075.out --include --trace-ascii log/trace2075 --trace-time --disallow-username-in-url http://username:password@example.com/ >log/stdout2075 2>log/stderr2075
CMD (17152): ../src/curl.exe --output log/curl2075.out --include --trace-ascii log/trace2075 --trace-time --disallow-username-in-url http://username:password@example.com/ >log/stdout2075 2>log/stderr2075
-------e--- OK (1390 out of 1415, remaining: 00:01, took 0.257s, duration: 01:33)
* starts no server
test 2080...[config file with overly long option]
../src/curl.exe --output log/curl2080.out --include --trace-ascii log/trace2080 --trace-time -K log/config2080 file://dev/null >log/stdout2080 2>log/stderr2080
CMD (768): ../src/curl.exe --output log/curl2080.out --include --trace-ascii log/trace2080 --trace-time -K log/config2080 file://dev/null >log/stdout2080 2>log/stderr2080
-------e--- OK (1394 out of 1415, remaining: 00:01, took 0.255s, duration: 01:33)
test 2100 SKIPPED: curl lacks DoH support
test 3017...[MQTT SUBSCRIBE with pathological PUBLISH length]
../src/curl.exe --output log/curl3017.out --include --trace log/trace3017 --trace-time mqtt://127.0.0.1:55678/3017 -m 3 >log/stdout3017 2>log/stderr3017
CMD (2048): ../src/curl.exe --output log/curl3017.out --include --trace log/trace3017 --trace-time mqtt://127.0.0.1:55678/3017 -m 3 >log/stdout3017 2>log/stderr3017
--p----e--- OK (1414 out of 1415, remaining: 00:00, took 0.284s, duration: 01:34)
test 3018...[MQTT SUBSCRIBE with PUBLISH larger than --max-filesize]
../src/curl.exe --output log/curl3018.out --include --trace log/trace3018 --trace-time mqtt://127.0.0.1:55678/3018 --max-filesize 11 >log/stdout3018 2>log/stderr3018
CMD (16128): ../src/curl.exe --output log/curl3018.out --include --trace log/trace3018 --trace-time mqtt://127.0.0.1:55678/3018 --max-filesize 11 >log/stdout3018 2>log/stderr3018
--p----e--- OK (1415 out of 1415, remaining: 00:00, took 0.276s, duration: 01:34)
* kill pid for httptls => 33655
* kill pid for mqtt => 70328
* kill pid for mqtt => 33738
RUN: Process with pid 33655 signalled to die
RUN: Process with pid 33738 signalled to die
RUN: Process with pid 70328 already dead
RUN: Process with pid 33655 forced to die with SIGKILL
RUN: Process with pid 33738 forced to die with SIGKILL
TESTDONE: 1429 tests were considered during 94 seconds.
TESTINFO: 1318 tests were skipped due to these restraints:
TESTINFO: "failed starting HTTP server" 404 times (1, 2, 3, 4, 9, 10, 11, 12, 13 and 395 more)
TESTINFO: "curl lacks ftp server support" 219 times (100, 101, 102, 103, 104, 105, 106, 107, 108 and 210 more)
TESTINFO: "curl lacks proxy support" 109 times (5, 16, 43, 63, 80, 82, 83, 84, 85 and 100 more)
TESTINFO: "curl lacks crypto support" 80 times (64, 65, 72, 88, 153, 154, 167, 168, 175 and 71 more)
TESTINFO: "curl lacks smtp server support" 56 times (646, 648, 649, 652, 900, 901, 902, 903, 904 and 47 more)
TESTINFO: "curl lacks NTLM support" 49 times (67, 68, 69, 70, 81, 89, 90, 91, 150 and 40 more)
TESTINFO: "curl lacks imap server support" 46 times (647, 660, 800, 801, 802, 803, 804, 805, 806 and 37 more)
TESTINFO: "disabled by keyword" 38 times (6, 7, 8, 27, 31, 46, 53, 61, 62 and 29 more)
TESTINFO: "curl lacks sftp server support" 37 times (582, 583, 600, 602, 604, 606, 608, 609, 610 and 28 more)
TESTINFO: "curl lacks pop3 server support" 32 times (850, 851, 852, 853, 854, 855, 856, 857, 858 and 23 more)
TESTINFO: "curl lacks file support" 30 times (288, 1016, 1017, 1018, 1019, 1020, 1063, 1422, 1463 and 21 more)
TESTINFO: "no stunnel" 26 times (300, 301, 303, 304, 305, 306, 307, 308, 310 and 17 more)
TESTINFO: "curl lacks file server support" 20 times (200, 201, 202, 203, 204, 205, 231, 502, 1145 and 11 more)
TESTINFO: "curl lacks tftp server support" 17 times (271, 283, 284, 285, 286, 332, 1007, 1009, 1049 and 8 more)
TESTINFO: "curl lacks libz support" 15 times (220, 221, 222, 223, 224, 230, 232, 319, 328 and 6 more)
TESTINFO: "configured as DISABLED" 14 times (323, 594, 836, 882, 938, 1056, 1182, 1209, 1211 and 5 more)
TESTINFO: "curl lacks idn support" 14 times (165, 962, 963, 964, 965, 966, 967, 968, 969 and 5 more)
TESTINFO: "curl lacks scp server support" 12 times (601, 603, 605, 607, 617, 619, 621, 623, 629 and 3 more)
TESTINFO: "curl lacks ftp support" 11 times (79, 208, 299, 549, 550, 561, 1059, 1077, 1092 and 2 more)
TESTINFO: "curl lacks ftps server support" 9 times (400, 401, 403, 404, 406, 407, 408, 409, 1112)
TESTINFO: "curl has win32 support" 8 times (955, 956, 957, 958, 959, 960, 961, 3016)
TESTINFO: "failed starting HTTP-IPv6 server" 7 times (240, 241, 242, 1046, 1083, 1265, 1324)
TESTINFO: "curl lacks rtsp server support" 7 times (567, 568, 569, 570, 571, 572, 577)
TESTINFO: "curl lacks ftp-ipv6 server support" 6 times (252, 253, 254, 255, 1048, 1050)
TESTINFO: "curl lacks alt-svc support" 6 times (355, 356, 358, 359, 1654, 1908)
TESTINFO: "curl lacks GSS-API support" 5 times (1282, 2056, 2057, 2077, 2078)
TESTINFO: "curl lacks brotli support" 3 times (314, 315, 316)
TESTINFO: "curl lacks TrackMemory support" 3 times (96, 558, 1330)
TESTINFO: "curl lacks http/2 server support" 3 times (1700, 1701, 1702)
TESTINFO: "curl lacks gopher server support" 3 times (1200, 1201, 1202)
TESTINFO: "curl lacks unix-sockets support" 3 times (1268, 1435, 1436)
TESTINFO: "curl lacks telnet support" 3 times (1326, 1327, 1452)
TESTINFO: "curl lacks DoH support" 3 times (1650, 1655, 2100)
TESTINFO: "curl lacks manual support" 2 times (1026, 1179)
TESTINFO: "curl lacks sftp support" 2 times (632, 1459)
TESTINFO: "curl lacks Schannel support" 2 times (2043, 2070)
TESTINFO: "curl lacks getrlimit support" 2 times (518, 537)
TESTINFO: "curl lacks http/2 support" 1 time (1800)
TESTINFO: "curl lacks dict support" 1 time (1450)
TESTINFO: "curl lacks PSL support" 1 time (1136)
TESTINFO: "curl lacks NTLM_WB support" 1 time (1310)
TESTINFO: "precheck command error" 1 time (1169)
TESTINFO: "curl lacks gophers server support" 1 time (1272)
TESTINFO: "curl has threaded-resolver support" 1 time (506)
TESTINFO: "curl lacks tftp support" 1 time (1453)
TESTINFO: "curl lacks smb support" 1 time (1451)
TESTINFO: "curl lacks Unicode support" 1 time (1703)
TESTINFO: "curl lacks gopher-ipv6 server support" 1 time (1203)
TESTINFO: "curl has ipv6 support" 1 time (1454)
TESTDONE: 107 tests out of 111 reported OK: 96%

TESTFAIL: These test cases failed: 320 321 322 324

make[1]: *** [Makefile:816: full-test] Error 1
make[1]: Leaving directory '/build-1916/tests'
make: *** [Makefile:1719: test-full] Error 2
testcurl: tests were run
testcurl: the tests were not successful
testcurl: ending nicely
testcurl: removing the build-1916 dir
testcurl: removing the buildlog-1916 file

Download build log